Loading ...
Sorry, an error occurred while loading the content.

Re: WSJT 7 OS X compile

Expand Messages
  • green.earth1
    I am compiling from the freebsd branch & I am getting these errors with make. Can anyone tell me how to correct this? Thanks! ptt_unix.c:66:20: error:
    Message 1 of 2 , Aug 12, 2008
    • 0 Attachment
      I am compiling from the freebsd branch & I am getting these errors with make. Can anyone
      tell me how to correct this?
      Thanks!

      ptt_unix.c:66:20: error: sys/io.h: No such file or directory
      ptt_unix.c:78: error: 'MAXPATHLEN' undeclared here (not in a function)
      ptt_unix.c: In function 'ptt_':
      ptt_unix.c:113: warning: implicit declaration of function 'lp_reset'
      make: *** [ptt_unix.o] Error 1
    Your message has been successfully submitted and would be delivered to recipients shortly.