Loading ...
Sorry, an error occurred while loading the content.

[Bug:7.0aa] Cannot make snaphot 153: popupmenu.pro not found

Expand Messages
  • A. J. Mechelynck
    Extract from make log (using Make_cyg.mak on 7.0aa source snapshot 0153) ... gcc -c -O3 -fomit-frame-pointer -freg-struct-return -fno-strength-reduce -DWIN32
    Message 1 of 5 , Oct 3, 2005
    • 0 Attachment
      Extract from make log (using Make_cyg.mak on 7.0aa source snapshot 0153)

      -----
      gcc -c -O3 -fomit-frame-pointer -freg-struct-return -fno-strength-reduce
      -DWIN32 -DHAVE_PATHDEF -DFEAT_BIG -DWINVER=0x0400 -D_WIN32_WINNT=0x0400
      -DFEAT_PERL -DDYNAMIC_PERL -DDYNAMIC_PERL_DLL=\"perl58.dll\"
      -DFEAT_PYTHON -DDYNAMIC_PYTHON -DDYNAMIC_PYTHON_DLL=\"python24.dll\"
      -DFEAT_RUBY -DDYNAMIC_RUBY -DDYNAMIC_RUBY_DLL=\"msvcrt-ruby18.dll\"
      -DDYNAMIC_RUBY_VER=18 -DFEAT_MZSCHEME -DDYNAMIC_MZSCHEME
      -DDYNAMIC_MZSCH_DLL=\"libmzsch209_000.dll\"
      -DDYNAMIC_MZGC_DLL=\"libmzgc209_000.dll\" -DFEAT_TCL -DDYNAMIC_TCL
      -DDYNAMIC_TCL_DLL=\"tcl83.dll\" -DDYNAMIC_GETTEXT -DDYNAMIC_ICONV
      -DFEAT_MBYTE -DFEAT_MBYTE_IME -DDYNAMIC_IME -DFEAT_CSCOPE -march=i386
      -Iproto -I/cygdrive/c/Perl/lib/CORE -I/cygdrive/c/Python24/include
      -I/cygdrive/c/ruby/lib/ruby/1.8/i386-mswin32
      -I/cygdrive/c/PROGRA~1/MZSCHEME/include -I/cygdrive/c/ruby/include -s
      -mno-cygwin buffer.c -o obj/buffer.o
      In file included from vim.h:1675,
      from buffer.c:28:
      proto.h:146:26: popupmenu.pro: No such file or directory
      make: *** [obj/buffer.o] Error 1
      -----

      proto.h line 146 is
      # include "popupmenu.pro"


      Best regards,
      Tony.
    • Bram Moolenaar
      ... I forgot to include the new popupmenu files in the list of distributed files. I ll make another snapshot. -- Wi n0t trei a h0liday in Sweden thi yer?
      Message 2 of 5 , Oct 4, 2005
      • 0 Attachment
        Tony Mechelynck wrote:

        > Extract from make log (using Make_cyg.mak on 7.0aa source snapshot 0153)
        >
        > -----
        > proto.h:146:26: popupmenu.pro: No such file or directory
        > make: *** [obj/buffer.o] Error 1
        > -----

        I forgot to include the new popupmenu files in the list of distributed
        files. I'll make another snapshot.

        --
        Wi n0t trei a h0liday in Sweden thi yer?
        "Monty Python and the Holy Grail" PYTHON (MONTY) PICTURES LTD

        /// Bram Moolenaar -- Bram@... -- http://www.Moolenaar.net \\\
        /// Sponsor Vim, vote for features -- http://www.Vim.org/sponsor/ \\\
        \\\ Project leader for A-A-P -- http://www.A-A-P.org ///
        \\\ Buy LOTR 3 and help AIDS victims -- http://ICCF.nl/lotr.html ///
      • Rene de Zwart
        ... It might need to be added to cvs also. I did a cvs -z3 update on Tue Oct 4 11:30 CEST 2005 and got the same problem Rene
        Message 3 of 5 , Oct 4, 2005
        • 0 Attachment
          On Tue, Oct 04, 2005 at 11:05:40AM +0200, Bram Moolenaar wrote:
          >
          > Tony Mechelynck wrote:
          >
          > > Extract from make log (using Make_cyg.mak on 7.0aa source snapshot 0153)
          > >
          > > -----
          > > proto.h:146:26: popupmenu.pro: No such file or directory
          > > make: *** [obj/buffer.o] Error 1
          > > -----
          >
          > I forgot to include the new popupmenu files in the list of distributed
          > files. I'll make another snapshot.
          >
          It might need to be added to cvs also. I did a
          cvs -z3 update
          on
          Tue Oct 4 11:30 CEST 2005
          and got the same problem

          Rene
        • Bram Moolenaar
          ... CVS is using the same list. So I can make this mistake only once :-). I uploaded snapshot 154 with the popupmenu files added and a fix for test32. --
          Message 4 of 5 , Oct 4, 2005
          • 0 Attachment
            Rene de Zwart wrote:

            > On Tue, Oct 04, 2005 at 11:05:40AM +0200, Bram Moolenaar wrote:
            > >
            > > Tony Mechelynck wrote:
            > >
            > > > Extract from make log (using Make_cyg.mak on 7.0aa source snapshot 0153)
            > > >
            > > > -----
            > > > proto.h:146:26: popupmenu.pro: No such file or directory
            > > > make: *** [obj/buffer.o] Error 1
            > > > -----
            > >
            > > I forgot to include the new popupmenu files in the list of distributed
            > > files. I'll make another snapshot.
            > >
            > It might need to be added to cvs also. I did a
            > cvs -z3 update
            > on
            > Tue Oct 4 11:30 CEST 2005
            > and got the same problem

            CVS is using the same list. So I can make this mistake only once :-).

            I uploaded snapshot 154 with the popupmenu files added and a fix for
            test32.

            --
            Mushrooms always grow in damp places and so they look like umbrellas.

            /// Bram Moolenaar -- Bram@... -- http://www.Moolenaar.net \\\
            /// Sponsor Vim, vote for features -- http://www.Vim.org/sponsor/ \\\
            \\\ Project leader for A-A-P -- http://www.A-A-P.org ///
            \\\ Buy LOTR 3 and help AIDS victims -- http://ICCF.nl/lotr.html ///
          • A. J. Mechelynck
            Bram Moolenaar wrote: [...] ... OK. I just rolled a compile, there were no fatal errors, I m busy packaging the results, they should soon appear on my site.
            Message 5 of 5 , Oct 4, 2005
            • 0 Attachment
              Bram Moolenaar wrote:
              [...]
              > I uploaded snapshot 154 with the popupmenu files added and a fix for
              > test32.

              OK. I just rolled a compile, there were no fatal errors, I'm busy
              packaging the results, they should soon appear on my site.

              Best regards,
              Tony.
            Your message has been successfully submitted and would be delivered to recipients shortly.