Loading ...
Sorry, an error occurred while loading the content.

52575Re: Regression introduced in patch 7.2.50: fwrite() failures incorrectly checked

Expand Messages
  • Elimar Riesebieter
    Nov 29 4:42 AM
      * Dominique Pelle [081129 09:10 +0100]
      >
      > Tests 58 and 59 fail when doing 'make test' with latest Vim-7.2.55
      > (huge version, tested on Linux).
      >
      > I tried older versions:
      >
      > - Vim-7.2.49 .... All tests pass
      > - Vim-7.2.50 .... Tests 58 & 59 fail.

      Same here:

      Test results:
      test58 FAILED
      test59 FAILED
      TEST FAILURE
      make[2]: *** [report] Error 1
      make[2]: Leaving directory
      `/source/vim/vim-7.2.055/src/vim-basic/testdir'
      make[1]: *** [test] Error 2
      make[1]: Leaving directory `/source/vim/vim-7.2.055/src/vim-basic'
      make: *** [install-stamp-vim-basic] Error 2

      Elimar


      --
      "Talking much about oneself can also
      be a means to conceal oneself."
      -Friedrich Nietzsche

      --~--~---------~--~----~------------~-------~--~----~
      You received this message from the "vim_dev" maillist.
      For more information, visit http://www.vim.org/maillist.php
      -~----------~----~----~----~------~----~------~--~---
    • Show all 7 messages in this topic