Loading ...
Sorry, an error occurred while loading the content.
 

Compilation fails since 7.0.239

Expand Messages
  • Andre Berger
    Up to 7.0.238, everything compiled fine (on 10.4.9, w/ & w/o the ... gcc -c -I. -Iproto -DHAVE_CONFIG_H -DFEAT_GUI_MAC -fno-common -fpascal-strings -Wall
    Message 1 of 4 , May 5, 2007
      Up to 7.0.238, everything compiled fine (on 10.4.9, w/ & w/o the
      atsui patch). Ever since then, all I get is:

      -----------------
      gcc -c -I. -Iproto -DHAVE_CONFIG_H -DFEAT_GUI_MAC -fno-common -fpascal-strings -Wall -Wno-unknown-pragmas -mdynamic-no-pic -pipe -I. -Iproto -arch ppc -DMACOS_X_UNIX -no-cpp-precomp -I/Developer/Headers/FlatCarbon -Os -o objects/buffer.o buffer.c
      In file included from /usr/include/mach/host_info.h:62,
      from /usr/include/mach/mach_types.h:68,
      from /System/Library/Frameworks/IOKit.framework/Headers/IOKitLib.h:38,
      from /System/Library/Frameworks/DiskArbitration.framework/Headers/DADisk.h:28,
      from /System/Library/Frameworks/CoreServices.framework/Frameworks/CarbonCore.framework/Headers/Files.h:62,
      from /System/Library/Frameworks/CoreServices.framework/Frameworks/CarbonCore.framework/Headers/Components.h:32,
      from /System/Library/Frameworks/CoreServices.framework/Frameworks/CarbonCore.framework/Headers/CarbonCore.h:81,
      from /System/Library/Frameworks/CoreServices.framework/Headers/CoreServices.h:21,
      from /System/Library/Frameworks/ApplicationServices.framework/Headers/ApplicationServices.h:20,
      from /Developer/Headers/FlatCarbon/Quickdraw.h:1,
      from os_mac.h:26,
      from vim.h:304,
      from buffer.c:28:
      /usr/include/mach/message.h:115: error: stray ‘\14’ in program
      /usr/include/mach/message.h:115: error: stray ‘\251’ in program
      /usr/include/mach/message.h:115: error: stray ‘\147’ in program
      /usr/include/mach/message.h:115: error: stray ‘\147’ in program
      /usr/include/mach/message.h:115: error: stray ‘\134’ in program
      /usr/include/mach/message.h:115: error: stray ‘\24’ in program
      /usr/include/mach/message.h:115: error: stray ‘\165’ in program
      /usr/include/mach/message.h:115: error: parse error before ‘aZ’

      [snip]

      /usr/include/mach/message.h:130: error: parse error before ‘mach_msg_size_t’
      /usr/include/mach/message.h:131: error: parse error before ‘:’ token
      /usr/include/mach/message.h:141: error: parse error before ‘mach_msg_copy_options_t’
      /usr/include/mach/message.h:151: error: parse error before ‘mach_msg_size_t’
      /usr/include/mach/message.h:153: error: parse error before ‘:’ token
      /usr/include/mach/message.h:169: error: parse error before ‘mach_msg_port_descriptor_t’
      /usr/include/mach/message.h:171: error: parse error before ‘ool_ports’
      /usr/include/mach/message.h:172: error: parse error before ‘type’
      /usr/include/mach/message.h:177: error: parse error before ‘mach_msg_size_t’
      /usr/include/mach/message.h:185: error: parse error before ‘mach_msg_bits_t’
      /usr/include/mach/message.h:189: error: parse error before ‘msgh_reserved’
      /usr/include/mach/message.h:190: error: parse error before ‘msgh_id’
      /usr/include/mach/message.h:197: error: parse error before ‘mach_msg_header_t’
      /usr/include/mach/message.h:290: error: parse error before ‘mach_msg_header_t’
      /usr/include/mach/message.h:295: error: parse error before ‘mach_msg_header_t’
      /usr/include/mach/message.h:297: error: parse error before ‘}’ token
      /usr/include/mach/message.h:301: error: parse error before ‘mach_msg_empty_send_t’
      /usr/include/mach/message.h:305: error: too many #pragma options align=reset
      /usr/include/mach/message.h:552: error: parse error before ‘*’ token
      /usr/include/mach/message.h:572: error: parse error before ‘*’ token
      In file included from /System/Library/Frameworks/DiskArbitration.framework/Headers/DADisk.h:28,
      from /System/Library/Frameworks/CoreServices.framework/Frameworks/CarbonCore.framework/Headers/Files.h:62,
      from /System/Library/Frameworks/CoreServices.framework/Frameworks/CarbonCore.framework/Headers/Components.h:32,
      from /System/Library/Frameworks/CoreServices.framework/Frameworks/CarbonCore.framework/Headers/CarbonCore.h:81,
      from /System/Library/Frameworks/CoreServices.framework/Headers/CoreServices.h:21,
      from /System/Library/Frameworks/ApplicationServices.framework/Headers/ApplicationServices.h:20,
      from /Developer/Headers/FlatCarbon/Quickdraw.h:1,
      from os_mac.h:26,
      from vim.h:304,
      from buffer.c:28:
      /System/Library/Frameworks/IOKit.framework/Headers/IOKitLib.h:159: error: parse error before ‘mach_msg_header_t’
      /System/Library/Frameworks/IOKit.framework/Headers/IOKitLib.h:1145: error: parse error before ‘*’ token
      ^CInterrupted by signal 2
      make[1]: *** [objects/buffer.o] Interrupt
      make: *** [first] Interrupt
      -----------------

      -André

      --
      May as well be hung for a sheep as a lamb
      Linux Kernel 2.6/PPC for Linkstation/KuroBox/HG/HS from http://hvkls.dyndns.org
    • Jussi Hagman
      ... Earlier today I successfully compiled svn revision 254 w/o the atsui patch. So I would suggest the problems you are seeing are probably not related to vim.
      Message 2 of 4 , May 5, 2007
        On 5 May 2007, at 11:00, Andre Berger wrote:

        > Up to 7.0.238, everything compiled fine (on 10.4.9, w/ & w/o the
        > atsui patch). Ever since then, all I get is:

        Earlier today I successfully compiled svn revision 254 w/o the atsui
        patch. So I would suggest the problems you are seeing are probably
        not related to vim.

        > /usr/include/mach/message.h:115: error: stray ‘\14’ in program
        > /usr/include/mach/message.h:115: error: stray ‘\251’ in program
        > /usr/include/mach/message.h:115: error: stray ‘\147’ in program
        > /usr/include/mach/message.h:115: error: stray ‘\147’ in program
        > /usr/include/mach/message.h:115: error: stray ‘\134’ in program
        > /usr/include/mach/message.h:115: error: stray ‘\24’ in program
        > /usr/include/mach/message.h:115: error: stray ‘\165’ in program
        > /usr/include/mach/message.h:115: error: parse error before ‘aZ’

        If I am reading this correctly the stray characters are in /usr/
        include/mach/message.h, not in the vim files. Have you checked the
        file around row 115? does it seem ok?

        Greetings,
        Jussi

        --
        Jussi Hagman, jhagman@..., iChat/AIM: jussihagman, ICQ: 54004113
        Studentbyn 4 D 33, 20540 Åbo, Finland +358 50 56 51 170
      • John (Eljay) Love-Jensen
        ... On my OS X system, /usr/include/mach/message.h is a blank line. Sincerely, --Eljay
        Message 3 of 4 , May 5, 2007
          > /usr/include/mach/message.h:115: error: stray '\14' in program
          > /usr/include/mach/message.h:115: error: stray '\251' in program
          > /usr/include/mach/message.h:115: error: stray '\147' in program
          > /usr/include/mach/message.h:115: error: stray '\147' in program
          > /usr/include/mach/message.h:115: error: stray '\134' in program
          > /usr/include/mach/message.h:115: error: stray '\24' in program
          > /usr/include/mach/message.h:115: error: stray '\165' in program
          > /usr/include/mach/message.h:115: error: parse error before 'aZ'

          On my OS X system, /usr/include/mach/message.h is a blank line.

          Sincerely,
          --Eljay
        • Andre Berger
          ... No, there s garbage in it. Looks like filesystem corruption to me! -André -- May as well be hung for a sheep as a lamb Linux Kernel 2.6/PPC for
          Message 4 of 4 , May 5, 2007
            * Jussi Hagman (2007-05-05):
            >
            > On 5 May 2007, at 11:00, Andre Berger wrote:
            >
            > > Up to 7.0.238, everything compiled fine (on 10.4.9, w/ & w/o the
            > > atsui patch). Ever since then, all I get is:
            >
            > Earlier today I successfully compiled svn revision 254 w/o the atsui patch. So I would suggest
            > the problems you are seeing are probably not related to vim.
            >
            > > /usr/include/mach/message.h:115: error: stray ‘\14’ in program
            > > /usr/include/mach/message.h:115: error: stray ‘\251’ in program
            > > /usr/include/mach/message.h:115: error: stray ‘\147’ in program
            > > /usr/include/mach/message.h:115: error: stray ‘\147’ in program
            > > /usr/include/mach/message.h:115: error: stray ‘\134’ in program
            > > /usr/include/mach/message.h:115: error: stray ‘\24’ in program
            > > /usr/include/mach/message.h:115: error: stray ‘\165’ in program
            > > /usr/include/mach/message.h:115: error: parse error before ‘aZ’
            >
            > If I am reading this correctly the stray characters are in /usr/include/mach/message.h, not in
            > the vim files. Have you checked the file around row 115? does it seem ok?

            No, there's garbage in it. Looks like filesystem corruption to me!

            -André

            --
            May as well be hung for a sheep as a lamb
            Linux Kernel 2.6/PPC for Linkstation/KuroBox/HG/HS from http://hvkls.dyndns.org
          Your message has been successfully submitted and would be delivered to recipients shortly.