Loading ...
Sorry, an error occurred while loading the content.

problem installing SOAP::Lite

Expand Messages
  • Michael Powe
    I ve spent quite a bit of time trying to fix this but I just can t parse these errors. If someone could help me out, I would much appreciate it. SOAP::Lite
    Message 1 of 2 , Nov 1, 2004
    • 0 Attachment
      I've spent quite a bit of time trying to fix this but I just can't
      parse these errors. If someone could help me out, I would much
      appreciate it. SOAP::Lite is a required dependency for something else
      I'm installing and I'm dead in the water.

      Thanks.

      mp

      Running make test
      PERL_DL_NONLAZY=1 /usr/bin/perl5.8.4 "-MExtUtils::Command::MM" "-e"
      "test_harness(0, 'blib/lib', 'blib/arch')" t/01-core.t t/02-payload.t
      t/03-server.t t/04-attach.t t/05-customxml.t t/06-modules.t
      t/07-xmlrpc_payload.t t/08-schema.t
      t/01-core..............ok

      t/02-payload...........ok

      t/03-server............NOK 2# Failed test 2 in t/03-server.t at line
      138 fail #2
      # t/03-server.t line 138 is: $_ =~ /XML/ || $is_mimeparser ?
      ok(($result->faultstring || '') =~ /Failed to access class
      \(Calculator\)/)
      t/03-server............NOK 3# Failed test 3 in t/03-server.t at line
      138 fail #3
      t/03-server............NOK 6# Failed test 6 in t/03-server.t at line
      148 fail #2
      # t/03-server.t line 148 is: $_ =~ /XML/ || $is_mimeparser ?
      ok(($result->result || 0) == 7)
      t/03-server............NOK 7# Failed test 7 in t/03-server.t at line
      148 fail #3
      t/03-server............FAILED tests 2-3, 6-7

      Failed 4/30 tests, 86.67% okay
      t/04-attach............Something wrong with MIME message:
      MIME::Parser: can't flush: at
      /usr/lib/perl5/site_perl/5.8.4/MIME/Parser.pm line 789.

      t/04-attach............dubious

      Test returned status 255 (wstat 65280, 0xff00)
      DIED. FAILED tests 1-15
      Failed 15/15 tests, 0.00% okay
      t/05-customxml.........ok

      t/06-modules...........ok

      1/18 skipped: Can't locate MQClient/MQSeries.pm in @INC (@INC
      contains: /root/.cpan/build/SOAP-Lite-0.60/blib/lib
      /root/.cpan/build/SOAP-Lite-0.60/blib/arch
      /usr/lib/perl5/5.8.4/i486-linux /usr/lib/perl5/5.8.4/i486-linux
      /usr/lib/perl5/5.8.4 /usr/lib/perl5/site_perl/5.8.4/i486-linux
      /usr/lib/perl5/site_perl/5.8.4/i486-linux
      /usr/lib/perl5/site_perl/5.8.4 /usr/lib/perl5/site_perl/5.8.0
      /usr/lib/perl5/site_perl/5.8.4/i486-linux
      /usr/lib/perl5/site_perl/5.8.4 /usr/lib/perl5/site_perl/5.8.0
      /usr/lib/perl5/site_perl . /usr/lib/perl5/5.8.4/i486-linux
      /usr/lib/perl5/5.8.4 /usr/lib/perl5/site_perl/5.8.4/i486-linux
      /usr/lib/perl5/site_perl/5.8.4 /usr/lib/perl5/site_perl/5.8.0
      /usr/lib/perl5/site_perl .) at
      /root/.cpan/build/SOAP-Lite-0.60/blib/lib/SOAP/Transport/MQ.pm line
      17.
      t/07-xmlrpc_payload....ok

      t/08-schema............ok

      Failed Test Stat Wstat Total Fail Failed List of Failed
      --------------------------------------------------
      -----------------------------
      t/03-server.t 30 4 13.33% 2-3 6-7
      t/04-attach.t 255 65280 15 30 200.00% 1-15
      1 subtest skipped.
      Failed 2/8 test scripts, 75.00% okay. 19/308 subtests failed, 93.83%
      okay.
      make: *** [test_dynamic] Error 255
      /usr/bin/make test -- NOT OK
      Running make install
      make test had returned bad status, won't install without force
    • Byrne Reese
      The next release of SOAP::Lite should have a better MIME::Tools detection mechanism so that these tests will be skipped (and thus not fail) if MIME::Tools is
      Message 2 of 2 , Nov 14, 2004
      • 0 Attachment
        The next release of SOAP::Lite should have a better MIME::Tools
        detection mechanism so that these tests will be skipped (and thus not
        fail) if MIME::Tools is not installed.

        Byrne

        Michael Powe wrote:

        >
        > I've spent quite a bit of time trying to fix this but I just can't
        > parse these errors. If someone could help me out, I would much
        > appreciate it. SOAP::Lite is a required dependency for something else
        > I'm installing and I'm dead in the water.
        >
        > Thanks.
        >
        > mp
        >
        > Running make test
        > PERL_DL_NONLAZY=1 /usr/bin/perl5.8.4 "-MExtUtils::Command::MM" "-e"
        > "test_harness(0, 'blib/lib', 'blib/arch')" t/01-core.t t/02-payload.t
        > t/03-server.t t/04-attach.t t/05-customxml.t t/06-modules.t
        > t/07-xmlrpc_payload.t t/08-schema.t
        > t/01-core..............ok
        >
        > t/02-payload...........ok
        >
        > t/03-server............NOK 2# Failed test 2 in t/03-server.t at line
        > 138 fail #2
        > # t/03-server.t line 138 is: $_ =~ /XML/ || $is_mimeparser ?
        > ok(($result->faultstring || '') =~ /Failed to access class
        > \(Calculator\)/)
        > t/03-server............NOK 3# Failed test 3 in t/03-server.t at line
        > 138 fail #3
        > t/03-server............NOK 6# Failed test 6 in t/03-server.t at line
        > 148 fail #2
        > # t/03-server.t line 148 is: $_ =~ /XML/ || $is_mimeparser ?
        > ok(($result->result || 0) == 7)
        > t/03-server............NOK 7# Failed test 7 in t/03-server.t at line
        > 148 fail #3
        > t/03-server............FAILED tests 2-3, 6-7
        >
        > Failed 4/30 tests, 86.67% okay
        > t/04-attach............Something wrong with MIME message:
        > MIME::Parser: can't flush: at
        > /usr/lib/perl5/site_perl/5.8.4/MIME/Parser.pm line 789.
        >
        > t/04-attach............dubious
        >
        > Test returned status 255 (wstat 65280, 0xff00)
        > DIED. FAILED tests 1-15
        > Failed 15/15 tests, 0.00% okay
        > t/05-customxml.........ok
        >
        > t/06-modules...........ok
        >
        > 1/18 skipped: Can't locate MQClient/MQSeries.pm in @INC (@INC
        > contains: /root/.cpan/build/SOAP-Lite-0.60/blib/lib
        > /root/.cpan/build/SOAP-Lite-0.60/blib/arch
        > /usr/lib/perl5/5.8.4/i486-linux /usr/lib/perl5/5.8.4/i486-linux
        > /usr/lib/perl5/5.8.4 /usr/lib/perl5/site_perl/5.8.4/i486-linux
        > /usr/lib/perl5/site_perl/5.8.4/i486-linux
        > /usr/lib/perl5/site_perl/5.8.4 /usr/lib/perl5/site_perl/5.8.0
        > /usr/lib/perl5/site_perl/5.8.4/i486-linux
        > /usr/lib/perl5/site_perl/5.8.4 /usr/lib/perl5/site_perl/5.8.0
        > /usr/lib/perl5/site_perl . /usr/lib/perl5/5.8.4/i486-linux
        > /usr/lib/perl5/5.8.4 /usr/lib/perl5/site_perl/5.8.4/i486-linux
        > /usr/lib/perl5/site_perl/5.8.4 /usr/lib/perl5/site_perl/5.8.0
        > /usr/lib/perl5/site_perl .) at
        > /root/.cpan/build/SOAP-Lite-0.60/blib/lib/SOAP/Transport/MQ.pm line
        > 17.
        > t/07-xmlrpc_payload....ok
        >
        > t/08-schema............ok
        >
        > Failed Test Stat Wstat Total Fail Failed List of Failed
        > --------------------------------------------------
        > -----------------------------
        > t/03-server.t 30 4 13.33% 2-3 6-7
        > t/04-attach.t 255 65280 15 30 200.00% 1-15
        > 1 subtest skipped.
        > Failed 2/8 test scripts, 75.00% okay. 19/308 subtests failed, 93.83%
        > okay.
        > make: *** [test_dynamic] Error 255
        > /usr/bin/make test -- NOT OK
        > Running make install
        > make test had returned bad status, won't install without force
        >
      Your message has been successfully submitted and would be delivered to recipients shortly.