Loading ...
Sorry, an error occurred while loading the content.

Build failed in Hudson: PCGen Maven 2 #152

Expand Messages
  • hudson@ci.pcgen.org
    See Changes: [James Dempsey] Move site to pcgen-test.org ... [...truncated 41803 lines...]
    Message 1 of 2 , Jan 8, 2010
    • 0 Attachment
      See <http://ci.pcgen.org/hudson/job/PCGen%20Maven%202/152/changes>

      Changes:

      [James Dempsey] Move site to pcgen-test.org

      ------------------------------------------
      [...truncated 41803 lines...]
      18:03:38.172 LSTERROR main AbstractTokenTestCase:219 Illegal ADD subtoken 'SPELLCASTER' '' for TestObj
      18:03:38.172 LSTERROR main AbstractTokenTestCase:219 Non-sensical ADD:SPELLCASTER: Contains ANY and a specific reference: ANY,TYPE=TestType
      18:03:38.173 LSTERROR main AbstractTokenTestCase:219 Failed in parsing subtoken: SPELLCASTER of ANY,TYPE=TestType
      18:03:38.173 LSTERROR main AbstractTokenTestCase:219 Illegal ADD subtoken 'SPELLCASTER' 'ANY,TYPE=TestType' for TestObj
      18:03:38.173 LSTERROR main AbstractTokenTestCase:219 Non-sensical ADD:SPELLCASTER: Contains ANY and a specific reference: TYPE=TestType,ANY
      18:03:38.173 LSTERROR main AbstractTokenTestCase:219 Failed in parsing subtoken: SPELLCASTER of TYPE=TestType,ANY
      18:03:38.174 LSTERROR main AbstractTokenTestCase:219 Illegal ADD subtoken 'SPELLCASTER' 'TYPE=TestType,ANY' for TestObj
      18:03:38.174 LSTERROR main AbstractTokenTestCase:219 Error was encountered while parsing ADD:SPELLCASTER: TYPE= is not a valid reference: TestWP3,TYPE=
      18:03:38.174 LSTERROR main AbstractTokenTestCase:219 Failed in parsing subtoken: SPELLCASTER of TestWP3,TYPE=
      18:03:38.174 LSTERROR main AbstractTokenTestCase:219 Illegal ADD subtoken 'SPELLCASTER' 'TestWP3,TYPE=' for TestObj
      18:03:38.174 LSTERROR main AbstractTokenTestCase:219 SPELLCASTER arguments uses double separator ,, : TestWP3,,TestWP4
      18:03:38.174 LSTERROR main AbstractTokenTestCase:219 Failed in parsing subtoken: SPELLCASTER of TestWP3,,TestWP4
      18:03:38.175 LSTERROR main AbstractTokenTestCase:219 Illegal ADD subtoken 'SPELLCASTER' 'TestWP3,,TestWP4' for TestObj
      18:03:38.175 LSTERROR main AbstractTokenTestCase:219 Non-sensical ADD:SPELLCASTER: Contains ANY and a specific reference: TestWP3,ANY
      18:03:38.175 LSTERROR main AbstractTokenTestCase:219 Failed in parsing subtoken: SPELLCASTER of TestWP3,ANY
      18:03:38.175 LSTERROR main AbstractTokenTestCase:219 Illegal ADD subtoken 'SPELLCASTER' 'TestWP3,ANY' for TestObj
      18:03:38.175 LSTERROR main AbstractTokenTestCase:219 ADD requires a SubToken and argument, found: SPELLCASTER
      18:03:38.175 LSTERROR main AbstractTokenTestCase:219 SPELLCASTER may not have empty argument
      18:03:38.176 LSTERROR main AbstractTokenTestCase:219 Failed in parsing subtoken: SPELLCASTER of
      18:03:38.176 LSTERROR main AbstractTokenTestCase:219 Illegal ADD subtoken 'SPELLCASTER' '' for TestObj
      18:03:38.176 LSTERROR main AbstractTokenTestCase:219 Count in ADD:SPELLCASTER must be > 0
      18:03:38.176 LSTERROR main AbstractTokenTestCase:219 Failed in parsing subtoken: SPELLCASTER of -1|TestWP1
      18:03:38.176 LSTERROR main AbstractTokenTestCase:219 Illegal ADD subtoken 'SPELLCASTER' '-1|TestWP1' for TestObj
      18:03:38.177 LSTERROR main AbstractTokenTestCase:219 Non-sensical ADD:SPELLCASTER: Contains ANY and a specific reference: ANY,TYPE=TestType
      18:03:38.177 LSTERROR main AbstractTokenTestCase:219 Failed in parsing subtoken: SPELLCASTER of ANY,TYPE=TestType
      18:03:38.177 LSTERROR main AbstractTokenTestCase:219 Illegal ADD subtoken 'SPELLCASTER' 'ANY,TYPE=TestType' for TestObj
      18:03:38.178 LSTERROR main AbstractTokenTestCase:219 Non-sensical ADD:SPELLCASTER: Contains ANY and a specific reference: TYPE=TestType,ANY
      18:03:38.178 LSTERROR main AbstractTokenTestCase:219 Failed in parsing subtoken: SPELLCASTER of TYPE=TestType,ANY
      18:03:38.178 LSTERROR main AbstractTokenTestCase:219 Illegal ADD subtoken 'SPELLCASTER' 'TYPE=TestType,ANY' for TestObj
      18:03:38.178 LSTERROR main AbstractTokenTestCase:219 Error was encountered while parsing ADD:SPELLCASTER: TYPE= is not a valid reference: TestWP3,TYPE=
      18:03:38.178 LSTERROR main AbstractTokenTestCase:219 Failed in parsing subtoken: SPELLCASTER of TestWP3,TYPE=
      18:03:38.178 LSTERROR main AbstractTokenTestCase:219 Illegal ADD subtoken 'SPELLCASTER' 'TestWP3,TYPE=' for TestObj
      18:03:38.179 LSTERROR main AbstractTokenTestCase:219 SPELLCASTER arguments uses double separator ,, : TestWP3,,TestWP4
      18:03:38.179 LSTERROR main AbstractTokenTestCase:219 Failed in parsing subtoken: SPELLCASTER of TestWP3,,TestWP4
      18:03:38.179 LSTERROR main AbstractTokenTestCase:219 Illegal ADD subtoken 'SPELLCASTER' 'TestWP3,,TestWP4' for TestObj
      18:03:38.179 LSTERROR main AbstractTokenTestCase:219 Non-sensical ADD:SPELLCASTER: Contains ANY and a specific reference: TestWP3,ANY
      18:03:38.179 LSTERROR main AbstractTokenTestCase:219 Failed in parsing subtoken: SPELLCASTER of TestWP3,ANY
      18:03:38.179 LSTERROR main AbstractTokenTestCase:219 Illegal ADD subtoken 'SPELLCASTER' 'TestWP3,ANY' for TestObj
      18:03:38.180 LSTERROR main AbstractTokenTestCase:219 ADD requires a SubToken and argument, found: SPELLCASTER
      18:03:38.180 LSTERROR main AbstractTokenTestCase:219 SPELLCASTER may not have empty argument
      18:03:38.180 LSTERROR main AbstractTokenTestCase:219 Failed in parsing subtoken: SPELLCASTER of
      18:03:38.180 LSTERROR main AbstractTokenTestCase:219 Illegal ADD subtoken 'SPELLCASTER' '' for TestObj
      18:03:38.180 LSTERROR main AbstractTokenTestCase:219 Count in ADD:SPELLCASTER must be > 0
      18:03:38.180 LSTERROR main AbstractTokenTestCase:219 Failed in parsing subtoken: SPELLCASTER of -1|TestWP1
      18:03:38.181 LSTERROR main AbstractTokenTestCase:219 Illegal ADD subtoken 'SPELLCASTER' '-1|TestWP1' for TestObj
      18:03:38.181 LSTERROR main AbstractTokenTestCase:219 Count in ADD:SPELLCASTER must be > 0
      18:03:38.181 LSTERROR main AbstractTokenTestCase:219 Failed in parsing subtoken: SPELLCASTER of 0|TestWP1
      18:03:38.181 LSTERROR main AbstractTokenTestCase:219 Illegal ADD subtoken 'SPELLCASTER' '0|TestWP1' for TestObj
      18:03:38.184 LSTERROR main AbstractTokenTestCase:219 Non-sensical ADD:SPELLCASTER: Contains ANY and a specific reference: ANY,TestWP1
      18:03:38.184 LSTERROR main AbstractTokenTestCase:219 Failed in parsing subtoken: SPELLCASTER of ANY,TestWP1
      18:03:38.184 LSTERROR main AbstractTokenTestCase:219 Illegal ADD subtoken 'SPELLCASTER' 'ANY,TestWP1' for TestObj
      18:03:38.185 LSTERROR main AbstractTokenTestCase:219 Non-sensical ADD:SPELLCASTER: Contains ANY and a specific reference: ANY,TestWP1
      18:03:38.185 LSTERROR main AbstractTokenTestCase:219 Failed in parsing subtoken: SPELLCASTER of ANY,TestWP1
      18:03:38.185 LSTERROR main AbstractTokenTestCase:219 Illegal ADD subtoken 'SPELLCASTER' 'ANY,TestWP1' for TestObj
      18:03:38.185 LSTERROR main AbstractTokenTestCase:219 Non-sensical ADD:SPELLCASTER: Contains ANY and a specific reference: TestWP1,ANY
      18:03:38.186 LSTERROR main AbstractTokenTestCase:219 Failed in parsing subtoken: SPELLCASTER of TestWP1,ANY
      18:03:38.186 LSTERROR main AbstractTokenTestCase:219 Illegal ADD subtoken 'SPELLCASTER' 'TestWP1,ANY' for TestObj
      Tests run: 61, Failures: 0, Errors: 0, Skipped: 0, Time elapsed: 0.097 sec
      Running plugin.lsttokens.editcontext.pcclass.KnownSpellsFromSpecialtyIntegrationTest
      18:03:38.189 SEVERE main TokenLibrary:171 Duplicate PCClass Token found for token KNOWNSPELLSFROMSPECIALTY
      Tests run: 11, Failures: 0, Errors: 0, Skipped: 0, Time elapsed: 0.004 sec
      Running plugin.lsttokens.equipmentmodifier.ArmortypeTokenTest
      18:03:38.193 SEVERE main TokenLibrary:171 Duplicate EquipmentModifier Token found for token ARMORTYPE
      18:03:38.193 LSTERROR main AbstractTokenTestCase:219 ARMORTYPE may not have empty argument
      18:03:38.195 LSTERROR main AbstractTokenTestCase:219 ARMORTYPE may not have empty argument
      18:03:38.195 LSTERROR main AbstractTokenTestCase:219 ARMORTYPE arguments uses double separator || : Light||Medium
      18:03:38.195 LSTERROR main AbstractTokenTestCase:219 ARMORTYPE may not have empty argument
      18:03:38.195 LSTERROR main AbstractTokenTestCase:219 ARMORTYPE arguments uses double separator || : Light||Medium
      18:03:38.196 LSTERROR main AbstractTokenTestCase:219 ARMORTYPE has no PIPE character: Must be of the form old|new
      18:03:38.196 LSTERROR main AbstractTokenTestCase:219 ARMORTYPE may not have empty argument
      18:03:38.196 LSTERROR main AbstractTokenTestCase:219 ARMORTYPE arguments uses double separator || : Light||Medium
      18:03:38.196 LSTERROR main AbstractTokenTestCase:219 ARMORTYPE has no PIPE character: Must be of the form old|new
      18:03:38.197 LSTERROR main AbstractTokenTestCase:219 ARMORTYPE arguments may not end with | : Medium|
      18:03:38.197 LSTERROR main AbstractTokenTestCase:219 ARMORTYPE may not have empty argument
      18:03:38.197 LSTERROR main AbstractTokenTestCase:219 ARMORTYPE arguments uses double separator || : Light||Medium
      18:03:38.197 LSTERROR main AbstractTokenTestCase:219 ARMORTYPE has no PIPE character: Must be of the form old|new
      18:03:38.198 LSTERROR main AbstractTokenTestCase:219 ARMORTYPE arguments may not end with | : Medium|
      18:03:38.198 LSTERROR main AbstractTokenTestCase:219 ARMORTYPE arguments may not start with | : |Medium
      18:03:38.198 LSTERROR main AbstractTokenTestCase:219 ARMORTYPE may not have empty argument
      18:03:38.198 LSTERROR main AbstractTokenTestCase:219 ARMORTYPE arguments uses double separator || : Light||Medium
      18:03:38.199 LSTERROR main AbstractTokenTestCase:219 ARMORTYPE has no PIPE character: Must be of the form old|new
      18:03:38.199 LSTERROR main AbstractTokenTestCase:219 ARMORTYPE arguments may not end with | : Medium|
      18:03:38.199 LSTERROR main AbstractTokenTestCase:219 ARMORTYPE arguments may not start with | : |Medium
      18:03:38.199 LSTERROR main AbstractTokenTestCase:219 ARMORTYPE has too many PIPE characters: Must be of the form old|new
      Tests run: 17, Failures: 0, Errors: 0, Skipped: 0, Time elapsed: 0.009 sec
      Running plugin.lsttokens.template.LevelAdjustmentTokenTest
      18:03:38.202 SEVERE main TokenLibrary:171 Duplicate PCTemplate Token found for token LEVELADJUSTMENT
      18:03:38.202 LSTERROR main AbstractTokenTestCase:219 ARMORTYPE may not have null argument
      18:03:38.202 LSTERROR main AbstractTokenTestCase:219 LEVELADJUSTMENT may not have empty argument
      Tests run: 10, Failures: 0, Errors: 0, Skipped: 0, Time elapsed: 0.003 sec

      Results :

      Tests run: 10651, Failures: 0, Errors: 0, Skipped: 0

      [HUDSON] Recording test results
      [INFO] Preparing surefire-report:report-only
      [INFO] No goals needed for project - skipping
      [INFO] [site:site {execution: default-site}]
      [INFO] Skipped "Surefire Report" report, file "JUnit Test Results.html" already exists for the English version.
      [INFO] Skipped "About" report, file "index.html" already exists for the English version.
      [WARNING] [XHTML Sink] No HTML tag found for unknown event: 'action', ignoring!
      [WARNING] [XHTML Sink] No HTML tag found for unknown event: 'release', ignoring!
      [INFO] Generating "Surefire Report" report.
      [WARNING] Unable to locate Test Source XRef to link to - DISABLED
      [INFO] Generating "Change Log" report.
      [INFO] Generating changed sets xml to: <http://ci.pcgen.org/hudson/job/PCGen%20Maven%202/ws/pcgen/target/changelog.xml>
      [INFO] Executing: svn --non-interactive log -v -r "{2009-10-11 07:03:46 +0000}:{2010-01-10 07:03:46 +0000}" https://pcgen.svn.sourceforge.net/svnroot/pcgen/Trunk/pcgen
      [INFO] Working directory: <http://ci.pcgen.org/hudson/job/PCGen%20Maven%202/ws/pcgen>
      [INFO] Generating "Developer Activity" report.
      [INFO] Using existing changelog.xml...
      [WARNING] No table content.
      [INFO] Generating "File Activity" report.
      [INFO] Using existing changelog.xml...
      [WARNING] No table content.
      [INFO] Generating "Checkstyle" report.
      [INFO] There are 505214 checkstyle errors.
      [WARNING] Unable to locate Source XRef to link to - DISABLED
      [INFO] Generating "Plugin Management" report.
      [INFO] Generating "Mailing Lists" report.
      [INFO] Generating "Continuous Integration" report.
      [INFO] Generating "Project License" report.
      [INFO] Generating "Project Team" report.
      [INFO] Generating "Source Repository" report.
      [INFO] Generating "Issue Tracking" report.
      [INFO] Generating "Project Summary" report.
      [INFO] Generating "Project Plugins" report.
      [INFO] Generating "Dependencies" report.
      [WARNING] The repository url 'http://jline.sourceforge.net/m2repo' is invalid - Repository 'jline' will be blacklisted.
      [WARNING] The repository url 'http://pcgen.sourceforge.net/mvnrepo' is invalid - Repository 'pcgen.repo' will be blacklisted.
      [WARNING] The repository url 'http://emma.sourceforge.net/maven' is invalid - Repository 'emma.repo' will be blacklisted.
      [WARNING] The repository url 'http://maven-plugins.sourceforge.net/maven' is invalid - Repository 'maven-plugins.repo' will be blacklisted.
      [INFO] Generating "Surefire Bericht" report.
      [WARNING] Unable to locate Test Source XRef to link to - DISABLED
      [INFO] Generating "Change Log" report.
      [INFO] Using existing changelog.xml...
      [INFO] Generating "Developer Activity" report.
      [INFO] Using existing changelog.xml...
      [WARNING] No table content.
      [INFO] Generating "File Activity" report.
      [INFO] Using existing changelog.xml...
      [WARNING] No table content.
      [INFO] Generating "Checkstyle" report.
      [INFO] There are 505214 checkstyle errors.
      [WARNING] Unable to locate Source XRef to link to - DISABLED
      [INFO] Generating "Plugin Management" report.
      [INFO] Generating "Mailinglisten" report.
      [INFO] Generating "Continuous Integration" report.
      [INFO] Generating "Projektlizenz" report.
      [INFO] Generating "Projektteam" report.
      [INFO] Generating "Quellcodearchiv" report.
      [INFO] Generating "Problembehandlung" report.
      [INFO] Generating "Zusammenfassung" report.
      [INFO] Generating "Project Plugins" report.
      [INFO] Generating "Abhängigkeiten" report.
      [INFO] Generating "Surefire Report" report.
      [WARNING] Unable to locate Test Source XRef to link to - DISABLED
      [INFO] Generating "Change Log" report.
      [INFO] Using existing changelog.xml...
      [INFO] Generating "Developer Activity" report.
      [INFO] Using existing changelog.xml...
      [WARNING] No table content.
      [INFO] Generating "File Activity" report.
      [INFO] Using existing changelog.xml...
      [WARNING] No table content.
      [INFO] Generating "Checkstyle" report.
      [INFO] There are 505214 checkstyle errors.
      [WARNING] Unable to locate Source XRef to link to - DISABLED
      [INFO] Generating "Gestion des plugins" report.
      [INFO] Generating "Listes de diffusion" report.
      [INFO] Generating "Intégration continue" report.
      [INFO] Generating "Licence du projet" report.
      [INFO] Generating "Membres de ce projet" report.
      [INFO] Generating "Dépôt de sources" report.
      [INFO] Generating "Contrôle des livraisons" report.
      [INFO] Generating "Résumé du projet" report.
      [INFO] Generating "Plugins du projets" report.
      [INFO] Generating "Dépendances" report.
      [HUDSON] Archiving site
      [INFO] [site:deploy {execution: default-cli}]
      file://localhost/home/pcgen/public_html/autobuilds/ - Session: Opened
      file://localhost/home/pcgen/public_html/autobuilds/ - Session: Disconnecting
      file://localhost/home/pcgen/public_html/autobuilds/ - Session: Disconnected
      [INFO] ------------------------------------------------------------------------
      [ERROR] BUILD ERROR
      [INFO] ------------------------------------------------------------------------
      [INFO] Error uploading site

      Embedded error: Error copying directory structure
      Unable to open file /home/pcgen/public_html/autobuilds/de/project-summary.html for writing.
      [INFO] ------------------------------------------------------------------------
      [INFO] Trace
      org.apache.maven.lifecycle.LifecycleExecutionException: Error uploading site
      at org.apache.maven.lifecycle.DefaultLifecycleExecutor.executeGoals(DefaultLifecycleExecutor.java:719)
      at org.apache.maven.lifecycle.DefaultLifecycleExecutor.executeStandaloneGoal(DefaultLifecycleExecutor.java:569)
      at org.apache.maven.lifecycle.DefaultLifecycleExecutor.executeGoal(DefaultLifecycleExecutor.java:539)
      at org.apache.maven.lifecycle.DefaultLifecycleExecutor.executeGoalAndHandleFailures(DefaultLifecycleExecutor.java:387)
      at org.apache.maven.lifecycle.DefaultLifecycleExecutor.executeTaskSegments(DefaultLifecycleExecutor.java:348)
      at org.apache.maven.lifecycle.DefaultLifecycleExecutor.execute(DefaultLifecycleExecutor.java:180)
      at org.apache.maven.lifecycle.LifecycleExecutorInterceptor.execute(LifecycleExecutorInterceptor.java:65)
      at org.apache.maven.DefaultMaven.doExecute(DefaultMaven.java:328)
      at org.apache.maven.DefaultMaven.execute(DefaultMaven.java:138)
      at org.apache.maven.cli.MavenCli.main(MavenCli.java:362)
      at sun.reflect.NativeMethodAccessorImpl.invoke0(Native Method)
      at sun.reflect.NativeMethodAccessorImpl.invoke(NativeMethodAccessorImpl.java:39)
      at sun.reflect.DelegatingMethodAccessorImpl.invoke(DelegatingMethodAccessorImpl.java:25)
      at java.lang.reflect.Method.invoke(Method.java:597)
      at org.codehaus.classworlds.Launcher.launchEnhanced(Launcher.java:315)
      at org.codehaus.classworlds.Launcher.launch(Launcher.java:255)
      at hudson.maven.agent.Main.launch(Main.java:165)
      at hudson.maven.MavenBuilder.call(MavenBuilder.java:159)
      at hudson.maven.MavenModuleSetBuild$Builder.call(MavenModuleSetBuild.java:688)
      at hudson.maven.MavenModuleSetBuild$Builder.call(MavenModuleSetBuild.java:632)
      at hudson.remoting.UserRequest.perform(UserRequest.java:104)
      at hudson.remoting.UserRequest.perform(UserRequest.java:48)
      at hudson.remoting.Request$2.run(Request.java:270)
      at java.util.concurrent.Executors$RunnableAdapter.call(Executors.java:441)
      at java.util.concurrent.FutureTask$Sync.innerRun(FutureTask.java:303)
      at java.util.concurrent.FutureTask.run(FutureTask.java:138)
      at java.util.concurrent.ThreadPoolExecutor$Worker.runTask(ThreadPoolExecutor.java:886)
      at java.util.concurrent.ThreadPoolExecutor$Worker.run(ThreadPoolExecutor.java:908)
      at java.lang.Thread.run(Thread.java:619)
      Caused by: org.apache.maven.plugin.MojoExecutionException: Error uploading site
      at org.apache.maven.plugins.site.SiteDeployMojo.execute(SiteDeployMojo.java:229)
      at org.apache.maven.plugin.DefaultPluginManager.executeMojo(DefaultPluginManager.java:490)
      at hudson.maven.agent.PluginManagerInterceptor.executeMojo(PluginManagerInterceptor.java:182)
      at org.apache.maven.lifecycle.DefaultLifecycleExecutor.executeGoals(DefaultLifecycleExecutor.java:694)
      ... 28 more
      Caused by: org.apache.maven.wagon.TransferFailedException: Error copying directory structure
      at org.apache.maven.wagon.providers.file.FileWagon.putDirectory(FileWagon.java:199)
      at org.apache.maven.plugins.site.SiteDeployMojo.execute(SiteDeployMojo.java:215)
      ... 31 more
      Caused by: java.io.IOException: Unable to open file /home/pcgen/public_html/autobuilds/de/project-summary.html for writing.
      at hidden.org.codehaus.plexus.util.FileUtils.copyStreamToFile(FileUtils.java:1099)
      at hidden.org.codehaus.plexus.util.FileUtils.copyFile(FileUtils.java:1013)
      at hidden.org.codehaus.plexus.util.FileUtils.copyFileToDirectory(FileUtils.java:955)
      at hidden.org.codehaus.plexus.util.FileUtils.copyDirectoryStructure(FileUtils.java:2055)
      at hidden.org.codehaus.plexus.util.FileUtils.copyDirectoryStructure(FileUtils.java:2066)
      at hidden.org.codehaus.plexus.util.FileUtils.copyDirectoryStructure(FileUtils.java:1979)
      at org.apache.maven.wagon.providers.file.FileWagon.putDirectory(FileWagon.java:195)
      ... 32 more
      [INFO] ------------------------------------------------------------------------
      [INFO] Total time: 8 minutes 7 seconds
      [INFO] Finished at: Sat Jan 09 18:10:23 EST 2010
      [INFO] Final Memory: 56M/653M
      [INFO] ------------------------------------------------------------------------
      Sending e-mails to: pcgen_developers@yahoogroups.com j.ames.dempsey@...
      Sending e-mails to: pcgen_developers@yahoogroups.com j.ames.dempsey@...
      channel stopped
    • hudson@ci.pcgen.org
      See
      Message 2 of 2 , Jan 9, 2010
      • 0 Attachment
      Your message has been successfully submitted and would be delivered to recipients shortly.