Loading ...
Sorry, an error occurred while loading the content.

Build failed in Jenkins: PCGen Trunk #3279

Expand Messages
  • hudson@ci.pcgen.org
    See ... Started by an SCM change [EnvInject] - Loading node environment variables. Building in workspace
    Message 1 of 1 , Dec 31, 2012
    • 0 Attachment
      See <http://ci.pcgen.org/jenkins/job/PCGen%20Trunk/3279/>

      ------------------------------------------
      Started by an SCM change
      [EnvInject] - Loading node environment variables.
      Building in workspace <http://ci.pcgen.org/jenkins/job/PCGen%20Trunk/ws/>
      Updating http://svn.code.sf.net/p/pcgen/code/Trunk/pcgen
      ERROR: Failed to update http://svn.code.sf.net/p/pcgen/code/Trunk/pcgen
      org.tmatesoft.svn.core.SVNException: svn: REPORT /p/pcgen/code/!svn/vcc/default failed
      at org.tmatesoft.svn.core.internal.io.dav.http.HTTPConnection.request(HTTPConnection.java:291)
      at org.tmatesoft.svn.core.internal.io.dav.http.HTTPConnection.request(HTTPConnection.java:276)
      at org.tmatesoft.svn.core.internal.io.dav.http.HTTPConnection.request(HTTPConnection.java:264)
      at org.tmatesoft.svn.core.internal.io.dav.DAVConnection.doReport(DAVConnection.java:266)
      at org.tmatesoft.svn.core.internal.io.dav.DAVConnection.doReport(DAVConnection.java:257)
      at org.tmatesoft.svn.core.internal.io.dav.DAVRepository.getDatedRevision(DAVRepository.java:198)
      at org.tmatesoft.svn.core.wc.SVNBasicClient.getRevisionNumber(SVNBasicClient.java:477)
      at org.tmatesoft.svn.core.wc.SVNBasicClient.getRevisionNumber(SVNBasicClient.java:465)
      at org.tmatesoft.svn.core.wc.SVNUpdateClient.update(SVNUpdateClient.java:541)
      at org.tmatesoft.svn.core.wc.SVNUpdateClient.doUpdate(SVNUpdateClient.java:401)
      at hudson.scm.subversion.UpdateUpdater$TaskImpl.perform(UpdateUpdater.java:134)
      at hudson.scm.subversion.WorkspaceUpdater$UpdateTask.delegateTo(WorkspaceUpdater.java:136)
      at hudson.scm.SubversionSCM$CheckOutTask.perform(SubversionSCM.java:780)
      at hudson.scm.SubversionSCM$CheckOutTask.invoke(SubversionSCM.java:761)
      at hudson.scm.SubversionSCM$CheckOutTask.invoke(SubversionSCM.java:745)
      at hudson.FilePath.act(FilePath.java:839)
      at hudson.FilePath.act(FilePath.java:821)
      at hudson.scm.SubversionSCM.checkout(SubversionSCM.java:735)
      at hudson.scm.SubversionSCM.checkout(SubversionSCM.java:677)
      at hudson.model.AbstractProject.checkout(AbstractProject.java:1226)
      at hudson.model.AbstractBuild$AbstractRunner.checkout(AbstractBuild.java:586)
      at hudson.model.AbstractBuild$AbstractRunner.run(AbstractBuild.java:475)
      at hudson.model.Run.run(Run.java:1438)
      at hudson.maven.MavenModuleSetBuild.run(MavenModuleSetBuild.java:477)
      at hudson.model.ResourceController.execute(ResourceController.java:88)
      at hudson.model.Executor.run(Executor.java:239)
      Caused by: org.tmatesoft.svn.core.SVNErrorMessage: svn: REPORT /p/pcgen/code/!svn/vcc/default failed
      at org.tmatesoft.svn.core.SVNErrorMessage.create(SVNErrorMessage.java:200)
      at org.tmatesoft.svn.core.SVNErrorMessage.create(SVNErrorMessage.java:146)
      at org.tmatesoft.svn.core.SVNErrorMessage.create(SVNErrorMessage.java:89)
      ... 26 more
      Caused by: org.tmatesoft.svn.core.SVNException: svn: REPORT request failed on '/p/pcgen/code/!svn/vcc/default'
      svn: Connection reset
      at org.tmatesoft.svn.core.internal.wc.SVNErrorManager.error(SVNErrorManager.java:64)
      at org.tmatesoft.svn.core.internal.wc.SVNErrorManager.error(SVNErrorManager.java:51)
      at org.tmatesoft.svn.core.internal.io.dav.http.HTTPConnection._request(HTTPConnection.java:644)
      at org.tmatesoft.svn.core.internal.io.dav.http.HTTPConnection.request(HTTPConnection.java:285)
      ... 25 more
      Caused by: org.tmatesoft.svn.core.SVNErrorMessage: svn: REPORT request failed on '/p/pcgen/code/!svn/vcc/default'
      at org.tmatesoft.svn.core.SVNErrorMessage.create(SVNErrorMessage.java:200)
      at org.tmatesoft.svn.core.internal.io.dav.http.HTTPConnection._request(HTTPConnection.java:642)
      ... 26 more
      Caused by: org.tmatesoft.svn.core.SVNErrorMessage: svn: Connection reset
      at org.tmatesoft.svn.core.SVNErrorMessage.create(SVNErrorMessage.java:101)
      at org.tmatesoft.svn.core.internal.io.dav.http.HTTPConnection._request(HTTPConnection.java:408)
      ... 26 more
      Caused by: java.net.SocketException: Connection reset
      at java.net.SocketInputStream.read(SocketInputStream.java:168)
      at java.io.BufferedInputStream.fill(BufferedInputStream.java:218)
      at java.io.BufferedInputStream.read(BufferedInputStream.java:237)
      at org.tmatesoft.svn.core.internal.io.dav.http.HTTPParser.readPlainLine(HTTPParser.java:69)
      at org.tmatesoft.svn.core.internal.io.dav.http.HTTPParser.readLine(HTTPParser.java:51)
      at org.tmatesoft.svn.core.internal.io.dav.http.HTTPParser.parseStatus(HTTPParser.java:39)
      at org.tmatesoft.svn.core.internal.io.dav.http.HTTPConnection.readHeader(HTTPConnection.java:198)
      at org.tmatesoft.svn.core.internal.io.dav.http.HTTPRequest.dispatch(HTTPRequest.java:175)
      at org.tmatesoft.svn.core.internal.io.dav.http.HTTPConnection._request(HTTPConnection.java:364)
      ... 26 more
      FATAL: null
      java.lang.NullPointerException
      at java.util.ArrayList.addAll(ArrayList.java:472)
      at hudson.scm.SubversionSCM.checkout(SubversionSCM.java:735)
      at hudson.scm.SubversionSCM.checkout(SubversionSCM.java:677)
      at hudson.model.AbstractProject.checkout(AbstractProject.java:1226)
      at hudson.model.AbstractBuild$AbstractRunner.checkout(AbstractBuild.java:586)
      at hudson.model.AbstractBuild$AbstractRunner.run(AbstractBuild.java:475)
      at hudson.model.Run.run(Run.java:1438)
      at hudson.maven.MavenModuleSetBuild.run(MavenModuleSetBuild.java:477)
      at hudson.model.ResourceController.execute(ResourceController.java:88)
      at hudson.model.Executor.run(Executor.java:239)
    Your message has been successfully submitted and would be delivered to recipients shortly.