Loading ...
Sorry, an error occurred while loading the content.
 

Build failed in Jenkins: PCGen Trunk #3008

Expand Messages
  • hudson@ci.pcgen.org
    See ... Started by user James Dempsey [EnvInject] - Loading node environment variables. Building in
    Message 1 of 2 , Dec 9, 2012
      See <http://ci.pcgen.org/jenkins/job/PCGen%20Trunk/3008/>

      ------------------------------------------
      Started by user James Dempsey
      [EnvInject] - Loading node environment variables.
      Building in workspace <http://ci.pcgen.org/jenkins/job/PCGen%20Trunk/ws/>
      Checking out a fresh workspace because the workspace is not https://svn.code.sf.net/p/pcgen/code/Trunk/pcgen
      Cleaning local Directory pcgen
      Checking out https://svn.code.sf.net/p/pcgen/code/Trunk/pcgen
      ERROR: Failed to check out https://svn.code.sf.net/p/pcgen/code/Trunk/pcgen
      org.tmatesoft.svn.core.SVNCancelException: svn: OPTIONS /p/pcgen/code/Trunk/pcgen failed
      at org.tmatesoft.svn.core.internal.io.dav.http.HTTPConnection.request(HTTPConnection.java:287)
      at org.tmatesoft.svn.core.internal.io.dav.http.HTTPConnection.request(HTTPConnection.java:276)
      at org.tmatesoft.svn.core.internal.io.dav.http.HTTPConnection.request(HTTPConnection.java:264)
      at org.tmatesoft.svn.core.internal.io.dav.DAVConnection.exchangeCapabilities(DAVConnection.java:516)
      at org.tmatesoft.svn.core.internal.io.dav.DAVConnection.open(DAVConnection.java:98)
      at org.tmatesoft.svn.core.internal.io.dav.DAVRepository.openConnection(DAVRepository.java:1001)
      at org.tmatesoft.svn.core.internal.io.dav.DAVRepository.getLatestRevision(DAVRepository.java:178)
      at org.tmatesoft.svn.core.wc.SVNBasicClient.getRevisionNumber(SVNBasicClient.java:482)
      at org.tmatesoft.svn.core.wc.SVNBasicClient.getLocations(SVNBasicClient.java:873)
      at org.tmatesoft.svn.core.wc.SVNBasicClient.createRepository(SVNBasicClient.java:534)
      at org.tmatesoft.svn.core.wc.SVNUpdateClient.doCheckout(SVNUpdateClient.java:901)
      at hudson.scm.subversion.CheckoutUpdater$1.perform(CheckoutUpdater.java:86)
      at hudson.scm.subversion.WorkspaceUpdater$UpdateTask.delegateTo(WorkspaceUpdater.java:136)
      at hudson.scm.subversion.WorkspaceUpdater$UpdateTask.delegateTo(WorkspaceUpdater.java:144)
      at hudson.scm.subversion.UpdateUpdater$TaskImpl.perform(UpdateUpdater.java:119)
      at hudson.scm.subversion.WorkspaceUpdater$UpdateTask.delegateTo(WorkspaceUpdater.java:136)
      at hudson.scm.SubversionSCM$CheckOutTask.perform(SubversionSCM.java:780)
      at hudson.scm.SubversionSCM$CheckOutTask.invoke(SubversionSCM.java:761)
      at hudson.scm.SubversionSCM$CheckOutTask.invoke(SubversionSCM.java:745)
      at hudson.FilePath.act(FilePath.java:839)
      at hudson.FilePath.act(FilePath.java:821)
      at hudson.scm.SubversionSCM.checkout(SubversionSCM.java:735)
      at hudson.scm.SubversionSCM.checkout(SubversionSCM.java:677)
      at hudson.model.AbstractProject.checkout(AbstractProject.java:1226)
      at hudson.model.AbstractBuild$AbstractRunner.checkout(AbstractBuild.java:586)
      at hudson.model.AbstractBuild$AbstractRunner.run(AbstractBuild.java:475)
      at hudson.model.Run.run(Run.java:1438)
      at hudson.maven.MavenModuleSetBuild.run(MavenModuleSetBuild.java:477)
      at hudson.model.ResourceController.execute(ResourceController.java:88)
      at hudson.model.Executor.run(Executor.java:239)
      Caused by: org.tmatesoft.svn.core.SVNCancelException: svn: No credential to try. Authentication failed
      at org.tmatesoft.svn.core.internal.wc.SVNErrorManager.cancel(SVNErrorManager.java:37)
      at org.tmatesoft.svn.core.internal.wc.SVNErrorManager.cancel(SVNErrorManager.java:32)
      at org.tmatesoft.svn.core.internal.wc.DefaultSVNAuthenticationManager.getFirstAuthentication(DefaultSVNAuthenticationManager.java:219)
      at org.tmatesoft.svn.core.internal.io.dav.http.HTTPConnection._request(HTTPConnection.java:563)
      at org.tmatesoft.svn.core.internal.io.dav.http.HTTPConnection.request(HTTPConnection.java:285)
      ... 29 more
      Caused by: org.tmatesoft.svn.core.SVNErrorMessage: svn: No credential to try. Authentication failed
      at org.tmatesoft.svn.core.SVNErrorMessage.create(SVNErrorMessage.java:200)
      at org.tmatesoft.svn.core.SVNErrorMessage.create(SVNErrorMessage.java:146)
      at org.tmatesoft.svn.core.SVNErrorMessage.create(SVNErrorMessage.java:89)
      ... 34 more
      FATAL: null
      java.lang.NullPointerException
      at java.util.ArrayList.addAll(ArrayList.java:472)
      at hudson.scm.SubversionSCM.checkout(SubversionSCM.java:735)
      at hudson.scm.SubversionSCM.checkout(SubversionSCM.java:677)
      at hudson.model.AbstractProject.checkout(AbstractProject.java:1226)
      at hudson.model.AbstractBuild$AbstractRunner.checkout(AbstractBuild.java:586)
      at hudson.model.AbstractBuild$AbstractRunner.run(AbstractBuild.java:475)
      at hudson.model.Run.run(Run.java:1438)
      at hudson.maven.MavenModuleSetBuild.run(MavenModuleSetBuild.java:477)
      at hudson.model.ResourceController.execute(ResourceController.java:88)
      at hudson.model.Executor.run(Executor.java:239)
    • hudson@ci.pcgen.org
      See ... Started by an SCM change [EnvInject] - Loading node environment variables. Building in workspace
      Message 2 of 2 , Dec 9, 2012
        See <http://ci.pcgen.org/jenkins/job/PCGen%20Trunk/3009/>

        ------------------------------------------
        Started by an SCM change
        [EnvInject] - Loading node environment variables.
        Building in workspace <http://ci.pcgen.org/jenkins/job/PCGen%20Trunk/ws/>
        Checking out a fresh workspace because there's no workspace at <http://ci.pcgen.org/jenkins/job/PCGen%20Trunk/ws/pcgen>
        Cleaning local Directory pcgen
        Checking out https://svn.code.sf.net/p/pcgen/code/Trunk/pcgen
        ERROR: Failed to check out https://svn.code.sf.net/p/pcgen/code/Trunk/pcgen
        org.tmatesoft.svn.core.SVNCancelException: svn: OPTIONS /p/pcgen/code/Trunk/pcgen failed
        at org.tmatesoft.svn.core.internal.io.dav.http.HTTPConnection.request(HTTPConnection.java:287)
        at org.tmatesoft.svn.core.internal.io.dav.http.HTTPConnection.request(HTTPConnection.java:276)
        at org.tmatesoft.svn.core.internal.io.dav.http.HTTPConnection.request(HTTPConnection.java:264)
        at org.tmatesoft.svn.core.internal.io.dav.DAVConnection.exchangeCapabilities(DAVConnection.java:516)
        at org.tmatesoft.svn.core.internal.io.dav.DAVConnection.open(DAVConnection.java:98)
        at org.tmatesoft.svn.core.internal.io.dav.DAVRepository.openConnection(DAVRepository.java:1001)
        at org.tmatesoft.svn.core.internal.io.dav.DAVRepository.getLatestRevision(DAVRepository.java:178)
        at org.tmatesoft.svn.core.wc.SVNBasicClient.getRevisionNumber(SVNBasicClient.java:482)
        at org.tmatesoft.svn.core.wc.SVNBasicClient.getLocations(SVNBasicClient.java:873)
        at org.tmatesoft.svn.core.wc.SVNBasicClient.createRepository(SVNBasicClient.java:534)
        at org.tmatesoft.svn.core.wc.SVNUpdateClient.doCheckout(SVNUpdateClient.java:901)
        at hudson.scm.subversion.CheckoutUpdater$1.perform(CheckoutUpdater.java:86)
        at hudson.scm.subversion.WorkspaceUpdater$UpdateTask.delegateTo(WorkspaceUpdater.java:136)
        at hudson.scm.subversion.WorkspaceUpdater$UpdateTask.delegateTo(WorkspaceUpdater.java:144)
        at hudson.scm.subversion.UpdateUpdater$TaskImpl.perform(UpdateUpdater.java:119)
        at hudson.scm.subversion.WorkspaceUpdater$UpdateTask.delegateTo(WorkspaceUpdater.java:136)
        at hudson.scm.SubversionSCM$CheckOutTask.perform(SubversionSCM.java:780)
        at hudson.scm.SubversionSCM$CheckOutTask.invoke(SubversionSCM.java:761)
        at hudson.scm.SubversionSCM$CheckOutTask.invoke(SubversionSCM.java:745)
        at hudson.FilePath.act(FilePath.java:839)
        at hudson.FilePath.act(FilePath.java:821)
        at hudson.scm.SubversionSCM.checkout(SubversionSCM.java:735)
        at hudson.scm.SubversionSCM.checkout(SubversionSCM.java:677)
        at hudson.model.AbstractProject.checkout(AbstractProject.java:1226)
        at hudson.model.AbstractBuild$AbstractRunner.checkout(AbstractBuild.java:586)
        at hudson.model.AbstractBuild$AbstractRunner.run(AbstractBuild.java:475)
        at hudson.model.Run.run(Run.java:1438)
        at hudson.maven.MavenModuleSetBuild.run(MavenModuleSetBuild.java:477)
        at hudson.model.ResourceController.execute(ResourceController.java:88)
        at hudson.model.Executor.run(Executor.java:239)
        Caused by: org.tmatesoft.svn.core.SVNCancelException: svn: No credential to try. Authentication failed
        at org.tmatesoft.svn.core.internal.wc.SVNErrorManager.cancel(SVNErrorManager.java:37)
        at org.tmatesoft.svn.core.internal.wc.SVNErrorManager.cancel(SVNErrorManager.java:32)
        at org.tmatesoft.svn.core.internal.wc.DefaultSVNAuthenticationManager.getFirstAuthentication(DefaultSVNAuthenticationManager.java:219)
        at org.tmatesoft.svn.core.internal.io.dav.http.HTTPConnection._request(HTTPConnection.java:563)
        at org.tmatesoft.svn.core.internal.io.dav.http.HTTPConnection.request(HTTPConnection.java:285)
        ... 29 more
        Caused by: org.tmatesoft.svn.core.SVNErrorMessage: svn: No credential to try. Authentication failed
        at org.tmatesoft.svn.core.SVNErrorMessage.create(SVNErrorMessage.java:200)
        at org.tmatesoft.svn.core.SVNErrorMessage.create(SVNErrorMessage.java:146)
        at org.tmatesoft.svn.core.SVNErrorMessage.create(SVNErrorMessage.java:89)
        ... 34 more
        FATAL: null
        java.lang.NullPointerException
        at java.util.ArrayList.addAll(ArrayList.java:472)
        at hudson.scm.SubversionSCM.checkout(SubversionSCM.java:735)
        at hudson.scm.SubversionSCM.checkout(SubversionSCM.java:677)
        at hudson.model.AbstractProject.checkout(AbstractProject.java:1226)
        at hudson.model.AbstractBuild$AbstractRunner.checkout(AbstractBuild.java:586)
        at hudson.model.AbstractBuild$AbstractRunner.run(AbstractBuild.java:475)
        at hudson.model.Run.run(Run.java:1438)
        at hudson.maven.MavenModuleSetBuild.run(MavenModuleSetBuild.java:477)
        at hudson.model.ResourceController.execute(ResourceController.java:88)
        at hudson.model.Executor.run(Executor.java:239)
      Your message has been successfully submitted and would be delivered to recipients shortly.