Loading ...
Sorry, an error occurred while loading the content.
 

Build failed in Jenkins: PCGen Trunk #1969

Expand Messages
  • hudson@ci.pcgen.org
    See ... Started by an SCM change ln -s 2012-05-06_09-31-05 /home/tomcat/.hudson/jobs/PCGen
    Message 1 of 2 , May 5, 2012
      See <http://ci.pcgen.org/hudson/job/PCGen%20Trunk/1969/>

      ------------------------------------------
      Started by an SCM change
      ln -s 2012-05-06_09-31-05 /home/tomcat/.hudson/jobs/PCGen Trunk/builds/1969 failed: -1
      Updating https://pcgen.svn.sourceforge.net/svnroot/pcgen/Trunk/pcgen
      U code/src/test/pcgen/gui2/facade/EquipmentSetFacadeImplTest.java
      U code/src/java/pcgen/gui2/tabs/equip/EquipmentModels.java
      U code/src/java/pcgen/gui2/facade/EquipmentSetFacadeImpl.java
      U code/src/java/pcgen/core/Equipment.java
      U code/src/java/pcgen/core/PlayerCharacter.java
      At revision 16699
      hudson.util.IOException2: revision check failed on https://pcgen.svn.sourceforge.net/svnroot/pcgen/Trunk/pcgen
      at hudson.scm.SubversionChangeLogBuilder.buildModule(SubversionChangeLogBuilder.java:158)
      at hudson.scm.SubversionChangeLogBuilder.run(SubversionChangeLogBuilder.java:100)
      at hudson.scm.SubversionSCM.calcChangeLog(SubversionSCM.java:536)
      at hudson.scm.SubversionSCM.checkout(SubversionSCM.java:653)
      at hudson.model.AbstractProject.checkout(AbstractProject.java:1174)
      at hudson.model.AbstractBuild$AbstractRunner.checkout(AbstractBuild.java:523)
      at hudson.model.AbstractBuild$AbstractRunner.run(AbstractBuild.java:418)
      at hudson.model.Run.run(Run.java:1362)
      at hudson.maven.MavenModuleSetBuild.run(MavenModuleSetBuild.java:467)
      at hudson.model.ResourceController.execute(ResourceController.java:88)
      at hudson.model.Executor.run(Executor.java:145)
      Caused by: org.tmatesoft.svn.core.SVNException: svn: PROPFIND /svnroot/pcgen/!svn/vcc/default failed
      at org.tmatesoft.svn.core.internal.io.dav.http.HTTPConnection.request(HTTPConnection.java:291)
      at org.tmatesoft.svn.core.internal.io.dav.http.HTTPConnection.request(HTTPConnection.java:276)
      at org.tmatesoft.svn.core.internal.io.dav.http.HTTPConnection.request(HTTPConnection.java:264)
      at org.tmatesoft.svn.core.internal.io.dav.DAVConnection.doPropfind(DAVConnection.java:126)
      at org.tmatesoft.svn.core.internal.io.dav.DAVUtil.getProperties(DAVUtil.java:73)
      at org.tmatesoft.svn.core.internal.io.dav.DAVUtil.getResourceProperties(DAVUtil.java:79)
      at org.tmatesoft.svn.core.internal.io.dav.DAVUtil.getPropertyValue(DAVUtil.java:93)
      at org.tmatesoft.svn.core.internal.io.dav.DAVUtil.getBaselineProperties(DAVUtil.java:245)
      at org.tmatesoft.svn.core.internal.io.dav.DAVUtil.getBaselineInfo(DAVUtil.java:184)
      at org.tmatesoft.svn.core.internal.io.dav.DAVRepository.getLatestRevision(DAVRepository.java:182)
      at org.tmatesoft.svn.core.wc.SVNBasicClient.getRevisionNumber(SVNBasicClient.java:482)
      at org.tmatesoft.svn.core.wc.SVNBasicClient.getLocations(SVNBasicClient.java:873)
      at org.tmatesoft.svn.core.wc.SVNBasicClient.createRepository(SVNBasicClient.java:534)
      at org.tmatesoft.svn.core.wc.SVNLogClient.doLog(SVNLogClient.java:1019)
      at org.tmatesoft.svn.core.wc.SVNLogClient.doLog(SVNLogClient.java:894)
      at org.tmatesoft.svn.core.wc.SVNLogClient.doLog(SVNLogClient.java:826)
      at hudson.scm.SubversionChangeLogBuilder.buildModule(SubversionChangeLogBuilder.java:146)
      ... 10 more
      Caused by: org.tmatesoft.svn.core.SVNErrorMessage: svn: PROPFIND /svnroot/pcgen/!svn/vcc/default failed
      at org.tmatesoft.svn.core.SVNErrorMessage.create(SVNErrorMessage.java:200)
      at org.tmatesoft.svn.core.SVNErrorMessage.create(SVNErrorMessage.java:146)
      at org.tmatesoft.svn.core.SVNErrorMessage.create(SVNErrorMessage.java:89)
      ... 27 more
      Caused by: org.tmatesoft.svn.core.SVNException: svn: PROPFIND request failed on '/svnroot/pcgen/!svn/vcc/default'
      svn: timed out waiting for server
      at org.tmatesoft.svn.core.internal.wc.SVNErrorManager.error(SVNErrorManager.java:64)
      at org.tmatesoft.svn.core.internal.wc.SVNErrorManager.error(SVNErrorManager.java:51)
      at org.tmatesoft.svn.core.internal.io.dav.http.HTTPConnection._request(HTTPConnection.java:644)
      at org.tmatesoft.svn.core.internal.io.dav.http.HTTPConnection.request(HTTPConnection.java:285)
      ... 26 more
      Caused by: org.tmatesoft.svn.core.SVNErrorMessage: svn: PROPFIND request failed on '/svnroot/pcgen/!svn/vcc/default'
      at org.tmatesoft.svn.core.SVNErrorMessage.create(SVNErrorMessage.java:200)
      at org.tmatesoft.svn.core.internal.io.dav.http.HTTPConnection._request(HTTPConnection.java:642)
      ... 27 more
      Caused by: org.tmatesoft.svn.core.SVNErrorMessage: svn: timed out waiting for server
      at org.tmatesoft.svn.core.SVNErrorMessage.create(SVNErrorMessage.java:200)
      at org.tmatesoft.svn.core.internal.io.dav.http.HTTPConnection._request(HTTPConnection.java:394)
      ... 27 more
      Caused by: java.net.SocketTimeoutException: connect timed out
      at java.net.PlainSocketImpl.socketConnect(Native Method)
      at java.net.PlainSocketImpl.doConnect(PlainSocketImpl.java:351)
      at java.net.PlainSocketImpl.connectToAddress(PlainSocketImpl.java:213)
      at java.net.PlainSocketImpl.connect(PlainSocketImpl.java:200)
      at java.net.SocksSocketImpl.connect(SocksSocketImpl.java:366)
      at java.net.Socket.connect(Socket.java:529)
      at com.sun.net.ssl.internal.ssl.SSLSocketImpl.connect(SSLSocketImpl.java:559)
      at org.tmatesoft.svn.core.internal.util.SVNSocketConnection.run(SVNSocketConnection.java:57)
      at java.lang.Thread.run(Thread.java:662)
    • hudson@ci.pcgen.org
      See
      Message 2 of 2 , May 5, 2012
      Your message has been successfully submitted and would be delivered to recipients shortly.