Loading ...
Sorry, an error occurred while loading the content.

Build failed in Jenkins: PCGen Nightly Build (Trunk) #613

Expand Messages
  • hudson@ci.pcgen.org
    See Changes: [amaitland] update My_GameMode to reflect new standards ...
    Message 1 of 1 , Apr 30 5:16 AM
    • 0 Attachment
      See <http://ci.pcgen.org/hudson/job/PCGen%20Nightly%20Build%20(Trunk)/613/changes>

      Changes:

      [amaitland] update My_GameMode to reflect new standards

      ------------------------------------------
      [...truncated 716111 lines...]
      at com.sun.org.apache.xerces.internal.impl.XMLVersionDetector.determineDocVersion(XMLVersionDetector.java:193)
      at com.sun.org.apache.xerces.internal.parsers.XML11Configuration.parse(XML11Configuration.java:772)
      at com.sun.org.apache.xerces.internal.parsers.XML11Configuration.parse(XML11Configuration.java:737)
      at com.sun.org.apache.xerces.internal.parsers.XMLParser.parse(XMLParser.java:119)
      at com.sun.org.apache.xerces.internal.parsers.AbstractSAXParser.parse(AbstractSAXParser.java:1205)
      at com.sun.org.apache.xerces.internal.jaxp.SAXParserImpl$JAXPSAXParser.parse(SAXParserImpl.java:522)
      at javax.xml.parsers.SAXParser.parse(SAXParser.java:395)
      at javax.xml.parsers.SAXParser.parse(SAXParser.java:198)
      at hudson.plugins.cobertura.CoberturaCoverageParser.parse(CoberturaCoverageParser.java:81)
      at hudson.plugins.cobertura.CoberturaCoverageParser.parse(CoberturaCoverageParser.java:52)
      at hudson.plugins.cobertura.CoberturaPublisher.perform(CoberturaPublisher.java:265)
      at hudson.tasks.BuildStepMonitor$3.perform(BuildStepMonitor.java:36)
      at hudson.model.AbstractBuild$AbstractRunner.perform(AbstractBuild.java:649)
      at hudson.model.AbstractBuild$AbstractRunner.performAllBuildSteps(AbstractBuild.java:625)
      at hudson.maven.MavenModuleSetBuild$RunnerImpl.post2(MavenModuleSetBuild.java:881)
      at hudson.model.AbstractBuild$AbstractRunner.post(AbstractBuild.java:572)
      at hudson.model.Run.run(Run.java:1386)
      at hudson.maven.MavenModuleSetBuild.run(MavenModuleSetBuild.java:467)
      at hudson.model.ResourceController.execute(ResourceController.java:88)
      at hudson.model.Executor.run(Executor.java:145)
      FATAL: Unable to parse /home/tomcat/.hudson/jobs/PCGen Nightly Build (Trunk)/builds/2011-04-30_22-01-02/coverage16208.xml
      com.sun.org.apache.xerces.internal.impl.io.MalformedByteSequenceException: Invalid byte 2 of 2-byte UTF-8 sequence.
      at com.sun.org.apache.xerces.internal.impl.io.UTF8Reader.invalidByte(UTF8Reader.java:684)
      at com.sun.org.apache.xerces.internal.impl.io.UTF8Reader.read(UTF8Reader.java:369)
      at com.sun.org.apache.xerces.internal.impl.XMLEntityScanner.load(XMLEntityScanner.java:1742)
      at com.sun.org.apache.xerces.internal.impl.XMLEntityScanner.arrangeCapacity(XMLEntityScanner.java:1619)
      at com.sun.org.apache.xerces.internal.impl.XMLEntityScanner.skipString(XMLEntityScanner.java:1657)
      at com.sun.org.apache.xerces.internal.impl.XMLVersionDetector.determineDocVersion(XMLVersionDetector.java:193)
      at com.sun.org.apache.xerces.internal.parsers.XML11Configuration.parse(XML11Configuration.java:772)
      at com.sun.org.apache.xerces.internal.parsers.XML11Configuration.parse(XML11Configuration.java:737)
      at com.sun.org.apache.xerces.internal.parsers.XMLParser.parse(XMLParser.java:119)
      at com.sun.org.apache.xerces.internal.parsers.AbstractSAXParser.parse(AbstractSAXParser.java:1205)
      at com.sun.org.apache.xerces.internal.jaxp.SAXParserImpl$JAXPSAXParser.parse(SAXParserImpl.java:522)
      at javax.xml.parsers.SAXParser.parse(SAXParser.java:395)
      at javax.xml.parsers.SAXParser.parse(SAXParser.java:198)
      at hudson.plugins.cobertura.CoberturaCoverageParser.parse(CoberturaCoverageParser.java:81)
      at hudson.plugins.cobertura.CoberturaCoverageParser.parse(CoberturaCoverageParser.java:52)
      at hudson.plugins.cobertura.CoberturaPublisher.perform(CoberturaPublisher.java:265)
      at hudson.tasks.BuildStepMonitor$3.perform(BuildStepMonitor.java:36)
      at hudson.model.AbstractBuild$AbstractRunner.perform(AbstractBuild.java:649)
      at hudson.model.AbstractBuild$AbstractRunner.performAllBuildSteps(AbstractBuild.java:625)
      at hudson.maven.MavenModuleSetBuild$RunnerImpl.post2(MavenModuleSetBuild.java:881)
      at hudson.model.AbstractBuild$AbstractRunner.post(AbstractBuild.java:572)
      at hudson.model.Run.run(Run.java:1386)
      at hudson.maven.MavenModuleSetBuild.run(MavenModuleSetBuild.java:467)
      at hudson.model.ResourceController.execute(ResourceController.java:88)
      at hudson.model.Executor.run(Executor.java:145)
      FATAL: Unable to parse /home/tomcat/.hudson/jobs/PCGen Nightly Build (Trunk)/builds/2011-04-30_22-01-02/coverage9660.xml
      com.sun.org.apache.xerces.internal.impl.io.MalformedByteSequenceException: Invalid byte 2 of 2-byte UTF-8 sequence.
      at com.sun.org.apache.xerces.internal.impl.io.UTF8Reader.invalidByte(UTF8Reader.java:684)
      at com.sun.org.apache.xerces.internal.impl.io.UTF8Reader.read(UTF8Reader.java:369)
      at com.sun.org.apache.xerces.internal.impl.XMLEntityScanner.load(XMLEntityScanner.java:1742)
      at com.sun.org.apache.xerces.internal.impl.XMLEntityScanner.arrangeCapacity(XMLEntityScanner.java:1619)
      at com.sun.org.apache.xerces.internal.impl.XMLEntityScanner.skipString(XMLEntityScanner.java:1657)
      at com.sun.org.apache.xerces.internal.impl.XMLVersionDetector.determineDocVersion(XMLVersionDetector.java:193)
      at com.sun.org.apache.xerces.internal.parsers.XML11Configuration.parse(XML11Configuration.java:772)
      at com.sun.org.apache.xerces.internal.parsers.XML11Configuration.parse(XML11Configuration.java:737)
      at com.sun.org.apache.xerces.internal.parsers.XMLParser.parse(XMLParser.java:119)
      at com.sun.org.apache.xerces.internal.parsers.AbstractSAXParser.parse(AbstractSAXParser.java:1205)
      at com.sun.org.apache.xerces.internal.jaxp.SAXParserImpl$JAXPSAXParser.parse(SAXParserImpl.java:522)
      at javax.xml.parsers.SAXParser.parse(SAXParser.java:395)
      at javax.xml.parsers.SAXParser.parse(SAXParser.java:198)
      at hudson.plugins.cobertura.CoberturaCoverageParser.parse(CoberturaCoverageParser.java:81)
      at hudson.plugins.cobertura.CoberturaCoverageParser.parse(CoberturaCoverageParser.java:52)
      at hudson.plugins.cobertura.CoberturaPublisher.perform(CoberturaPublisher.java:265)
      at hudson.tasks.BuildStepMonitor$3.perform(BuildStepMonitor.java:36)
      at hudson.model.AbstractBuild$AbstractRunner.perform(AbstractBuild.java:649)
      at hudson.model.AbstractBuild$AbstractRunner.performAllBuildSteps(AbstractBuild.java:625)
      at hudson.maven.MavenModuleSetBuild$RunnerImpl.post2(MavenModuleSetBuild.java:881)
      at hudson.model.AbstractBuild$AbstractRunner.post(AbstractBuild.java:572)
      at hudson.model.Run.run(Run.java:1386)
      at hudson.maven.MavenModuleSetBuild.run(MavenModuleSetBuild.java:467)
      at hudson.model.ResourceController.execute(ResourceController.java:88)
      at hudson.model.Executor.run(Executor.java:145)
      FATAL: Unable to parse /home/tomcat/.hudson/jobs/PCGen Nightly Build (Trunk)/builds/2011-04-30_22-01-02/coverage7042.xml
      hudson.util.IOException2: Cannot parse coverage results
      at hudson.plugins.cobertura.CoberturaCoverageParser.parse(CoberturaCoverageParser.java:89)
      at hudson.plugins.cobertura.CoberturaCoverageParser.parse(CoberturaCoverageParser.java:52)
      at hudson.plugins.cobertura.CoberturaPublisher.perform(CoberturaPublisher.java:265)
      at hudson.tasks.BuildStepMonitor$3.perform(BuildStepMonitor.java:36)
      at hudson.model.AbstractBuild$AbstractRunner.perform(AbstractBuild.java:649)
      at hudson.model.AbstractBuild$AbstractRunner.performAllBuildSteps(AbstractBuild.java:625)
      at hudson.maven.MavenModuleSetBuild$RunnerImpl.post2(MavenModuleSetBuild.java:881)
      at hudson.model.AbstractBuild$AbstractRunner.post(AbstractBuild.java:572)
      at hudson.model.Run.run(Run.java:1386)
      at hudson.maven.MavenModuleSetBuild.run(MavenModuleSetBuild.java:467)
      at hudson.model.ResourceController.execute(ResourceController.java:88)
      at hudson.model.Executor.run(Executor.java:145)
      Caused by: org.xml.sax.SAXParseException: Content is not allowed in prolog.
      at com.sun.org.apache.xerces.internal.util.ErrorHandlerWrapper.createSAXParseException(ErrorHandlerWrapper.java:195)
      at com.sun.org.apache.xerces.internal.util.ErrorHandlerWrapper.fatalError(ErrorHandlerWrapper.java:174)
      at com.sun.org.apache.xerces.internal.impl.XMLErrorReporter.reportError(XMLErrorReporter.java:388)
      at com.sun.org.apache.xerces.internal.impl.XMLScanner.reportFatalError(XMLScanner.java:1414)
      at com.sun.org.apache.xerces.internal.impl.XMLDocumentScannerImpl$PrologDriver.next(XMLDocumentScannerImpl.java:1039)
      at com.sun.org.apache.xerces.internal.impl.XMLDocumentScannerImpl.next(XMLDocumentScannerImpl.java:648)
      at com.sun.org.apache.xerces.internal.impl.XMLDocumentFragmentScannerImpl.scanDocument(XMLDocumentFragmentScannerImpl.java:511)
      at com.sun.org.apache.xerces.internal.parsers.XML11Configuration.parse(XML11Configuration.java:808)
      at com.sun.org.apache.xerces.internal.parsers.XML11Configuration.parse(XML11Configuration.java:737)
      at com.sun.org.apache.xerces.internal.parsers.XMLParser.parse(XMLParser.java:119)
      at com.sun.org.apache.xerces.internal.parsers.AbstractSAXParser.parse(AbstractSAXParser.java:1205)
      at com.sun.org.apache.xerces.internal.jaxp.SAXParserImpl$JAXPSAXParser.parse(SAXParserImpl.java:522)
      at javax.xml.parsers.SAXParser.parse(SAXParser.java:395)
      at javax.xml.parsers.SAXParser.parse(SAXParser.java:198)
      at hudson.plugins.cobertura.CoberturaCoverageParser.parse(CoberturaCoverageParser.java:81)
      ... 11 more
      FATAL: Unable to parse /home/tomcat/.hudson/jobs/PCGen Nightly Build (Trunk)/builds/2011-04-30_22-01-02/coverage18614.xml
      hudson.util.IOException2: Cannot parse coverage results
      at hudson.plugins.cobertura.CoberturaCoverageParser.parse(CoberturaCoverageParser.java:89)
      at hudson.plugins.cobertura.CoberturaCoverageParser.parse(CoberturaCoverageParser.java:52)
      at hudson.plugins.cobertura.CoberturaPublisher.perform(CoberturaPublisher.java:265)
      at hudson.tasks.BuildStepMonitor$3.perform(BuildStepMonitor.java:36)
      at hudson.model.AbstractBuild$AbstractRunner.perform(AbstractBuild.java:649)
      at hudson.model.AbstractBuild$AbstractRunner.performAllBuildSteps(AbstractBuild.java:625)
      at hudson.maven.MavenModuleSetBuild$RunnerImpl.post2(MavenModuleSetBuild.java:881)
      at hudson.model.AbstractBuild$AbstractRunner.post(AbstractBuild.java:572)
      at hudson.model.Run.run(Run.java:1386)
      at hudson.maven.MavenModuleSetBuild.run(MavenModuleSetBuild.java:467)
      at hudson.model.ResourceController.execute(ResourceController.java:88)
      at hudson.model.Executor.run(Executor.java:145)
      Caused by: org.xml.sax.SAXParseException: The element type "meta" must be terminated by the matching end-tag "</meta>".
      at com.sun.org.apache.xerces.internal.util.ErrorHandlerWrapper.createSAXParseException(ErrorHandlerWrapper.java:195)
      at com.sun.org.apache.xerces.internal.util.ErrorHandlerWrapper.fatalError(ErrorHandlerWrapper.java:174)
      at com.sun.org.apache.xerces.internal.impl.XMLErrorReporter.reportError(XMLErrorReporter.java:388)
      at com.sun.org.apache.xerces.internal.impl.XMLScanner.reportFatalError(XMLScanner.java:1414)
      at com.sun.org.apache.xerces.internal.impl.XMLDocumentFragmentScannerImpl.scanEndElement(XMLDocumentFragmentScannerImpl.java:1749)
      at com.sun.org.apache.xerces.internal.impl.XMLDocumentFragmentScannerImpl$FragmentContentDriver.next(XMLDocumentFragmentScannerImpl.java:2938)
      at com.sun.org.apache.xerces.internal.impl.XMLDocumentScannerImpl.next(XMLDocumentScannerImpl.java:648)
      at com.sun.org.apache.xerces.internal.impl.XMLDocumentFragmentScannerImpl.scanDocument(XMLDocumentFragmentScannerImpl.java:511)
      at com.sun.org.apache.xerces.internal.parsers.XML11Configuration.parse(XML11Configuration.java:808)
      at com.sun.org.apache.xerces.internal.parsers.XML11Configuration.parse(XML11Configuration.java:737)
      at com.sun.org.apache.xerces.internal.parsers.XMLParser.parse(XMLParser.java:119)
      at com.sun.org.apache.xerces.internal.parsers.AbstractSAXParser.parse(AbstractSAXParser.java:1205)
      at com.sun.org.apache.xerces.internal.jaxp.SAXParserImpl$JAXPSAXParser.parse(SAXParserImpl.java:522)
      at javax.xml.parsers.SAXParser.parse(SAXParser.java:395)
      at javax.xml.parsers.SAXParser.parse(SAXParser.java:198)
      at hudson.plugins.cobertura.CoberturaCoverageParser.parse(CoberturaCoverageParser.java:81)
      ... 11 more
      FATAL: Unable to parse /home/tomcat/.hudson/jobs/PCGen Nightly Build (Trunk)/builds/2011-04-30_22-01-02/coverage9874.xml
      com.sun.org.apache.xerces.internal.impl.io.MalformedByteSequenceException: Invalid byte 2 of 2-byte UTF-8 sequence.
      at com.sun.org.apache.xerces.internal.impl.io.UTF8Reader.invalidByte(UTF8Reader.java:684)
      at com.sun.org.apache.xerces.internal.impl.io.UTF8Reader.read(UTF8Reader.java:369)
      at com.sun.org.apache.xerces.internal.impl.XMLEntityScanner.load(XMLEntityScanner.java:1742)
      at com.sun.org.apache.xerces.internal.impl.XMLEntityScanner.arrangeCapacity(XMLEntityScanner.java:1619)
      at com.sun.org.apache.xerces.internal.impl.XMLEntityScanner.skipString(XMLEntityScanner.java:1657)
      at com.sun.org.apache.xerces.internal.impl.XMLVersionDetector.determineDocVersion(XMLVersionDetector.java:193)
      at com.sun.org.apache.xerces.internal.parsers.XML11Configuration.parse(XML11Configuration.java:772)
      at com.sun.org.apache.xerces.internal.parsers.XML11Configuration.parse(XML11Configuration.java:737)
      at com.sun.org.apache.xerces.internal.parsers.XMLParser.parse(XMLParser.java:119)
      at com.sun.org.apache.xerces.internal.parsers.AbstractSAXParser.parse(AbstractSAXParser.java:1205)
      at com.sun.org.apache.xerces.internal.jaxp.SAXParserImpl$JAXPSAXParser.parse(SAXParserImpl.java:522)
      at javax.xml.parsers.SAXParser.parse(SAXParser.java:395)
      at javax.xml.parsers.SAXParser.parse(SAXParser.java:198)
      at hudson.plugins.cobertura.CoberturaCoverageParser.parse(CoberturaCoverageParser.java:81)
      at hudson.plugins.cobertura.CoberturaCoverageParser.parse(CoberturaCoverageParser.java:52)
      at hudson.plugins.cobertura.CoberturaPublisher.perform(CoberturaPublisher.java:265)
      at hudson.tasks.BuildStepMonitor$3.perform(BuildStepMonitor.java:36)
      at hudson.model.AbstractBuild$AbstractRunner.perform(AbstractBuild.java:649)
      at hudson.model.AbstractBuild$AbstractRunner.performAllBuildSteps(AbstractBuild.java:625)
      at hudson.maven.MavenModuleSetBuild$RunnerImpl.post2(MavenModuleSetBuild.java:881)
      at hudson.model.AbstractBuild$AbstractRunner.post(AbstractBuild.java:572)
      at hudson.model.Run.run(Run.java:1386)
      at hudson.maven.MavenModuleSetBuild.run(MavenModuleSetBuild.java:467)
      at hudson.model.ResourceController.execute(ResourceController.java:88)
      at hudson.model.Executor.run(Executor.java:145)
      FATAL: Unable to parse /home/tomcat/.hudson/jobs/PCGen Nightly Build (Trunk)/builds/2011-04-30_22-01-02/coverage14062.xml
      com.sun.org.apache.xerces.internal.impl.io.MalformedByteSequenceException: Invalid byte 2 of 2-byte UTF-8 sequence.
      at com.sun.org.apache.xerces.internal.impl.io.UTF8Reader.invalidByte(UTF8Reader.java:684)
      at com.sun.org.apache.xerces.internal.impl.io.UTF8Reader.read(UTF8Reader.java:369)
      at com.sun.org.apache.xerces.internal.impl.XMLEntityScanner.load(XMLEntityScanner.java:1742)
      at com.sun.org.apache.xerces.internal.impl.XMLEntityScanner.arrangeCapacity(XMLEntityScanner.java:1619)
      at com.sun.org.apache.xerces.internal.impl.XMLEntityScanner.skipString(XMLEntityScanner.java:1657)
      at com.sun.org.apache.xerces.internal.impl.XMLVersionDetector.determineDocVersion(XMLVersionDetector.java:193)
      at com.sun.org.apache.xerces.internal.parsers.XML11Configuration.parse(XML11Configuration.java:772)
      at com.sun.org.apache.xerces.internal.parsers.XML11Configuration.parse(XML11Configuration.java:737)
      at com.sun.org.apache.xerces.internal.parsers.XMLParser.parse(XMLParser.java:119)
      at com.sun.org.apache.xerces.internal.parsers.AbstractSAXParser.parse(AbstractSAXParser.java:1205)
      at com.sun.org.apache.xerces.internal.jaxp.SAXParserImpl$JAXPSAXParser.parse(SAXParserImpl.java:522)
      at javax.xml.parsers.SAXParser.parse(SAXParser.java:395)
      at javax.xml.parsers.SAXParser.parse(SAXParser.java:198)
      at hudson.plugins.cobertura.CoberturaCoverageParser.parse(CoberturaCoverageParser.java:81)
      at hudson.plugins.cobertura.CoberturaCoverageParser.parse(CoberturaCoverageParser.java:52)
      at hudson.plugins.cobertura.CoberturaPublisher.perform(CoberturaPublisher.java:265)
      at hudson.tasks.BuildStepMonitor$3.perform(BuildStepMonitor.java:36)
      at hudson.model.AbstractBuild$AbstractRunner.perform(AbstractBuild.java:649)
      at hudson.model.AbstractBuild$AbstractRunner.performAllBuildSteps(AbstractBuild.java:625)
      at hudson.maven.MavenModuleSetBuild$RunnerImpl.post2(MavenModuleSetBuild.java:881)
      at hudson.model.AbstractBuild$AbstractRunner.post(AbstractBuild.java:572)
      at hudson.model.Run.run(Run.java:1386)
      at hudson.maven.MavenModuleSetBuild.run(MavenModuleSetBuild.java:467)
      at hudson.model.ResourceController.execute(ResourceController.java:88)
      at hudson.model.Executor.run(Executor.java:145)
      FATAL: Unable to parse /home/tomcat/.hudson/jobs/PCGen Nightly Build (Trunk)/builds/2011-04-30_22-01-02/coverage1320.xml
      hudson.util.IOException2: Cannot parse coverage results
      at hudson.plugins.cobertura.CoberturaCoverageParser.parse(CoberturaCoverageParser.java:89)
      at hudson.plugins.cobertura.CoberturaCoverageParser.parse(CoberturaCoverageParser.java:52)
      at hudson.plugins.cobertura.CoberturaPublisher.perform(CoberturaPublisher.java:265)
      at hudson.tasks.BuildStepMonitor$3.perform(BuildStepMonitor.java:36)
      at hudson.model.AbstractBuild$AbstractRunner.perform(AbstractBuild.java:649)
      at hudson.model.AbstractBuild$AbstractRunner.performAllBuildSteps(AbstractBuild.java:625)
      at hudson.maven.MavenModuleSetBuild$RunnerImpl.post2(MavenModuleSetBuild.java:881)
      at hudson.model.AbstractBuild$AbstractRunner.post(AbstractBuild.java:572)
      at hudson.model.Run.run(Run.java:1386)
      at hudson.maven.MavenModuleSetBuild.run(MavenModuleSetBuild.java:467)
      at hudson.model.ResourceController.execute(ResourceController.java:88)
      at hudson.model.Executor.run(Executor.java:145)
      Caused by: org.xml.sax.SAXParseException: Content is not allowed in prolog.
      at com.sun.org.apache.xerces.internal.util.ErrorHandlerWrapper.createSAXParseException(ErrorHandlerWrapper.java:195)
      at com.sun.org.apache.xerces.internal.util.ErrorHandlerWrapper.fatalError(ErrorHandlerWrapper.java:174)
      at com.sun.org.apache.xerces.internal.impl.XMLErrorReporter.reportError(XMLErrorReporter.java:388)
      at com.sun.org.apache.xerces.internal.impl.XMLScanner.reportFatalError(XMLScanner.java:1414)
      at com.sun.org.apache.xerces.internal.impl.XMLDocumentScannerImpl$PrologDriver.next(XMLDocumentScannerImpl.java:1039)
      at com.sun.org.apache.xerces.internal.impl.XMLDocumentScannerImpl.next(XMLDocumentScannerImpl.java:648)
      at com.sun.org.apache.xerces.internal.impl.XMLDocumentFragmentScannerImpl.scanDocument(XMLDocumentFragmentScannerImpl.java:511)
      at com.sun.org.apache.xerces.internal.parsers.XML11Configuration.parse(XML11Configuration.java:808)
      at com.sun.org.apache.xerces.internal.parsers.XML11Configuration.parse(XML11Configuration.java:737)
      at com.sun.org.apache.xerces.internal.parsers.XMLParser.parse(XMLParser.java:119)
      at com.sun.org.apache.xerces.internal.parsers.AbstractSAXParser.parse(AbstractSAXParser.java:1205)
      at com.sun.org.apache.xerces.internal.jaxp.SAXParserImpl$JAXPSAXParser.parse(SAXParserImpl.java:522)
      at javax.xml.parsers.SAXParser.parse(SAXParser.java:395)
      at javax.xml.parsers.SAXParser.parse(SAXParser.java:198)
      at hudson.plugins.cobertura.CoberturaCoverageParser.parse(CoberturaCoverageParser.java:81)
      ... 11 more
      ERROR: Publisher hudson.plugins.cobertura.CoberturaPublisher aborted due to exception
      java.lang.NullPointerException
      at hudson.plugins.cobertura.CoberturaXmlHandler.startElement(CoberturaCoverageParser.java:172)
      at com.sun.org.apache.xerces.internal.parsers.AbstractSAXParser.startElement(AbstractSAXParser.java:501)
      at com.sun.org.apache.xerces.internal.impl.XMLDocumentFragmentScannerImpl.scanStartElement(XMLDocumentFragmentScannerImpl.java:1363)
      at com.sun.org.apache.xerces.internal.impl.XMLDocumentFragmentScannerImpl$FragmentContentDriver.next(XMLDocumentFragmentScannerImpl.java:2755)
      at com.sun.org.apache.xerces.internal.impl.XMLDocumentScannerImpl.next(XMLDocumentScannerImpl.java:648)
      at com.sun.org.apache.xerces.internal.impl.XMLDocumentFragmentScannerImpl.scanDocument(XMLDocumentFragmentScannerImpl.java:511)
      at com.sun.org.apache.xerces.internal.parsers.XML11Configuration.parse(XML11Configuration.java:808)
      at com.sun.org.apache.xerces.internal.parsers.XML11Configuration.parse(XML11Configuration.java:737)
      at com.sun.org.apache.xerces.internal.parsers.XMLParser.parse(XMLParser.java:119)
      at com.sun.org.apache.xerces.internal.parsers.AbstractSAXParser.parse(AbstractSAXParser.java:1205)
      at com.sun.org.apache.xerces.internal.jaxp.SAXParserImpl$JAXPSAXParser.parse(SAXParserImpl.java:522)
      at javax.xml.parsers.SAXParser.parse(SAXParser.java:395)
      at javax.xml.parsers.SAXParser.parse(SAXParser.java:198)
      at hudson.plugins.cobertura.CoberturaCoverageParser.parse(CoberturaCoverageParser.java:81)
      at hudson.plugins.cobertura.CoberturaCoverageParser.parse(CoberturaCoverageParser.java:52)
      at hudson.plugins.cobertura.CoberturaPublisher.perform(CoberturaPublisher.java:265)
      at hudson.tasks.BuildStepMonitor$3.perform(BuildStepMonitor.java:36)
      at hudson.model.AbstractBuild$AbstractRunner.perform(AbstractBuild.java:649)
      at hudson.model.AbstractBuild$AbstractRunner.performAllBuildSteps(AbstractBuild.java:625)
      at hudson.maven.MavenModuleSetBuild$RunnerImpl.post2(MavenModuleSetBuild.java:881)
      at hudson.model.AbstractBuild$AbstractRunner.post(AbstractBuild.java:572)
      at hudson.model.Run.run(Run.java:1386)
      at hudson.maven.MavenModuleSetBuild.run(MavenModuleSetBuild.java:467)
      at hudson.model.ResourceController.execute(ResourceController.java:88)
      at hudson.model.Executor.run(Executor.java:145)
    Your message has been successfully submitted and would be delivered to recipients shortly.