Loading ...
Sorry, an error occurred while loading the content.

Build failed in Hudson: PCGen Ni ghtly Build (Trunk) » PCGen #568

Expand Messages
  • hudson@ci.pcgen.org
    See ... [...truncated 709666 lines...] 22:42:12.707 SEVERE
    Message 1 of 10 , Feb 10, 2011
    • 0 Attachment
      See <http://ci.pcgen.org/hudson/job/PCGen%20Nightly%20Build%20(Trunk)/net.sourceforge.pcgen$pcgen/568/>

      ------------------------------------------
      [...truncated 709666 lines...]
      22:42:12.707 SEVERE main LoadContext:93 !!LEGS must be an integer >= 0
      22:42:12.709 SEVERE main LoadContext:93 !!LEGS must be an integer >= 0
      Tests run: 18, Failures: 0, Errors: 0, Skipped: 0, Time elapsed: 0.053 sec
      Running plugin.lsttokens.campaign.WeaponProfTokenTest
      22:42:12.718 LSTERROR main AbstractTokenTestCase:230 WEAPONPROF may not have empty argument
      22:42:12.721 LSTERROR main AbstractTokenTestCase:230 WEAPONPROF may not have null argument
      22:42:12.722 LSTERROR main AbstractTokenTestCase:230 WEAPONPROF may not have null argument
      22:42:12.722 LSTERROR main AbstractTokenTestCase:230 WEAPONPROF arguments may not end with | : String|
      22:42:12.723 LSTERROR main AbstractTokenTestCase:230 WEAPONPROF may not have null argument
      22:42:12.723 LSTERROR main AbstractTokenTestCase:230 WEAPONPROF arguments may not end with | : String|
      22:42:12.723 LSTERROR main AbstractTokenTestCase:230 WEAPONPROF arguments may not start with | : |String
      22:42:12.724 SEVERE main CampaignSourceEntry:432 Found Suffix in Campaign Source without parenthesis: Parens required around INCLUDE/EXCLUDE
      22:42:12.724 SEVERE main CampaignSourceEntry:435 Found: 'Other' in String|Other
      22:42:12.724 LSTERROR main AbstractTokenTestCase:230 WEAPONPROF may not have null argument
      22:42:12.724 LSTERROR main AbstractTokenTestCase:230 WEAPONPROF arguments may not end with | : String|
      22:42:12.725 LSTERROR main AbstractTokenTestCase:230 WEAPONPROF arguments may not start with | : |String
      22:42:12.725 LSTERROR main AbstractTokenTestCase:230 Internal error.
      22:42:12.726 SEVERE main CampaignSourceEntry:432 Found Suffix in Campaign Source without parenthesis: Parens required around INCLUDE/EXCLUDE
      22:42:12.726 SEVERE main CampaignSourceEntry:435 Found: 'INCLUDE:Incl' in String|INCLUDE:Incl
      22:42:12.726 LSTERROR main AbstractTokenTestCase:230 WEAPONPROF may not have null argument
      22:42:12.726 LSTERROR main AbstractTokenTestCase:230 WEAPONPROF arguments may not end with | : String|
      22:42:12.726 LSTERROR main AbstractTokenTestCase:230 WEAPONPROF arguments may not start with | : |String
      22:42:12.726 LSTERROR main AbstractTokenTestCase:230 Internal error.
      22:42:12.726 LSTERROR main AbstractTokenTestCase:230 Internal error.
      22:42:12.729 SEVERE main CampaignSourceEntry:442 Found Suffix in Campaign Source with multiple parenthesis: Single set of parens required around INCLUDE/EXCLUDE
      22:42:12.729 SEVERE main CampaignSourceEntry:445 Found: '((INCLUDE:Incl))' in String|((INCLUDE:Incl))
      22:42:12.730 LSTERROR main AbstractTokenTestCase:230 WEAPONPROF may not have null argument
      22:42:12.730 LSTERROR main AbstractTokenTestCase:230 WEAPONPROF arguments may not end with | : String|
      22:42:12.730 LSTERROR main AbstractTokenTestCase:230 WEAPONPROF arguments may not start with | : |String
      22:42:12.730 LSTERROR main AbstractTokenTestCase:230 Internal error.
      22:42:12.730 LSTERROR main AbstractTokenTestCase:230 Internal error.
      22:42:12.730 LSTERROR main AbstractTokenTestCase:230 Internal error.
      22:42:12.731 SEVERE main CampaignSourceEntry:505 Must Specify Items after :
      22:42:12.731 LSTERROR main AbstractTokenTestCase:230 WEAPONPROF may not have null argument
      22:42:12.732 LSTERROR main AbstractTokenTestCase:230 WEAPONPROF arguments may not end with | : String|
      22:42:12.732 LSTERROR main AbstractTokenTestCase:230 WEAPONPROF arguments may not start with | : |String
      22:42:12.732 LSTERROR main AbstractTokenTestCase:230 Internal error.
      22:42:12.732 LSTERROR main AbstractTokenTestCase:230 Internal error.
      22:42:12.732 LSTERROR main AbstractTokenTestCase:230 Internal error.
      22:42:12.732 LSTERROR main AbstractTokenTestCase:230 Internal error.
      22:42:12.733 LSTERROR main CampaignSourceEntry:531 Invalid INCLUDE value on String in TestObj. Abilities must always have categories (e.g. INCLUDE:CATEGORY=cat1,key1,key2|CATEGORY=cat2,key1 ) and other file types should never have categories (e.g. INCLUDE:key1|key2 ).
      22:42:12.733 LSTERROR main AbstractTokenTestCase:230 WEAPONPROF may not have null argument
      22:42:12.734 LSTERROR main AbstractTokenTestCase:230 WEAPONPROF arguments may not end with | : String|
      22:42:12.734 LSTERROR main AbstractTokenTestCase:230 WEAPONPROF arguments may not start with | : |String
      22:42:12.734 LSTERROR main AbstractTokenTestCase:230 Internal error.
      22:42:12.734 LSTERROR main AbstractTokenTestCase:230 Internal error.
      22:42:12.734 LSTERROR main AbstractTokenTestCase:230 Internal error.
      22:42:12.734 LSTERROR main AbstractTokenTestCase:230 Internal error.
      22:42:12.734 LSTERROR main AbstractTokenTestCase:230 Internal error.
      22:42:12.735 SEVERE main CampaignSourceEntry:432 Found Suffix in Campaign Source without parenthesis: Parens required around INCLUDE/EXCLUDE
      22:42:12.735 SEVERE main CampaignSourceEntry:435 Found: 'EXCLUDE:Incl' in String|EXCLUDE:Incl
      22:42:12.736 LSTERROR main AbstractTokenTestCase:230 WEAPONPROF may not have null argument
      22:42:12.736 LSTERROR main AbstractTokenTestCase:230 WEAPONPROF arguments may not end with | : String|
      22:42:12.736 LSTERROR main AbstractTokenTestCase:230 WEAPONPROF arguments may not start with | : |String
      22:42:12.736 LSTERROR main AbstractTokenTestCase:230 Internal error.
      22:42:12.736 LSTERROR main AbstractTokenTestCase:230 Internal error.
      22:42:12.736 LSTERROR main AbstractTokenTestCase:230 Internal error.
      22:42:12.736 LSTERROR main AbstractTokenTestCase:230 Internal error.
      22:42:12.737 LSTERROR main AbstractTokenTestCase:230 Internal error.
      22:42:12.737 LSTERROR main AbstractTokenTestCase:230 Internal error.
      22:42:12.738 SEVERE main CampaignSourceEntry:442 Found Suffix in Campaign Source with multiple parenthesis: Single set of parens required around INCLUDE/EXCLUDE
      22:42:12.738 SEVERE main CampaignSourceEntry:445 Found: '((EXCLUDE:Incl))' in String|((EXCLUDE:Incl))
      22:42:12.738 LSTERROR main AbstractTokenTestCase:230 WEAPONPROF may not have null argument
      22:42:12.738 LSTERROR main AbstractTokenTestCase:230 WEAPONPROF arguments may not end with | : String|
      22:42:12.738 LSTERROR main AbstractTokenTestCase:230 WEAPONPROF arguments may not start with | : |String
      22:42:12.738 LSTERROR main AbstractTokenTestCase:230 Internal error.
      22:42:12.738 LSTERROR main AbstractTokenTestCase:230 Internal error.
      22:42:12.739 LSTERROR main AbstractTokenTestCase:230 Internal error.
      22:42:12.739 LSTERROR main AbstractTokenTestCase:230 Internal error.
      22:42:12.739 LSTERROR main AbstractTokenTestCase:230 Internal error.
      22:42:12.739 LSTERROR main AbstractTokenTestCase:230 Internal error.
      22:42:12.739 LSTERROR main AbstractTokenTestCase:230 Internal error.
      22:42:12.740 SEVERE main CampaignSourceEntry:505 Must Specify Items after :
      22:42:12.740 LSTERROR main AbstractTokenTestCase:230 WEAPONPROF may not have null argument
      22:42:12.740 LSTERROR main AbstractTokenTestCase:230 WEAPONPROF arguments may not end with | : String|
      22:42:12.740 LSTERROR main AbstractTokenTestCase:230 WEAPONPROF arguments may not start with | : |String
      22:42:12.741 LSTERROR main AbstractTokenTestCase:230 Internal error.
      22:42:12.741 LSTERROR main AbstractTokenTestCase:230 Internal error.
      22:42:12.741 LSTERROR main AbstractTokenTestCase:230 Internal error.
      22:42:12.741 LSTERROR main AbstractTokenTestCase:230 Internal error.
      22:42:12.741 LSTERROR main AbstractTokenTestCase:230 Internal error.
      22:42:12.741 LSTERROR main AbstractTokenTestCase:230 Internal error.
      22:42:12.741 LSTERROR main AbstractTokenTestCase:230 Internal error.
      22:42:12.741 LSTERROR main AbstractTokenTestCase:230 Internal error.
      22:42:12.742 LSTERROR main CampaignSourceEntry:531 Invalid EXCLUDE value on String in TestObj. Abilities must always have categories (e.g. EXCLUDE:CATEGORY=cat1,key1,key2|CATEGORY=cat2,key1 ) and other file types should never have categories (e.g. EXCLUDE:key1|key2 ).
      22:42:12.743 LSTERROR main AbstractTokenTestCase:230 WEAPONPROF may not have null argument
      22:42:12.743 LSTERROR main AbstractTokenTestCase:230 WEAPONPROF arguments may not end with | : String|
      22:42:12.743 LSTERROR main AbstractTokenTestCase:230 WEAPONPROF arguments may not start with | : |String
      22:42:12.743 LSTERROR main AbstractTokenTestCase:230 Internal error.
      22:42:12.743 LSTERROR main AbstractTokenTestCase:230 Internal error.
      22:42:12.743 LSTERROR main AbstractTokenTestCase:230 Internal error.
      22:42:12.743 LSTERROR main AbstractTokenTestCase:230 Internal error.
      22:42:12.743 LSTERROR main AbstractTokenTestCase:230 Internal error.
      22:42:12.744 LSTERROR main AbstractTokenTestCase:230 Internal error.
      22:42:12.744 LSTERROR main AbstractTokenTestCase:230 Internal error.
      22:42:12.744 LSTERROR main AbstractTokenTestCase:230 Internal error.
      22:42:12.744 LSTERROR main AbstractTokenTestCase:230 Internal error.
      Tests run: 24, Failures: 0, Errors: 0, Skipped: 0, Time elapsed: 0.047 sec
      Running actor.choose.SpellsTokenTest
      Tests run: 3, Failures: 0, Errors: 0, Skipped: 0, Time elapsed: 0.002 sec
      Running plugin.lsttokens.skill.ClassesTokenTest
      22:42:12.764 SEVERE main TokenLibrary:150 Duplicate Skill Token found for token CLASSES
      22:42:12.765 LSTERROR main AbstractTokenTestCase:230 CLASSES may not have empty argument
      22:42:12.768 LSTERROR main AbstractTokenTestCase:230 CLASSES arguments may not start with | : |Wizard
      22:42:12.768 LSTERROR main AbstractTokenTestCase:230 CLASSES arguments may not start with | : |Wizard
      22:42:12.768 LSTERROR main AbstractTokenTestCase:230 CLASSES arguments may not end with | : Wizard|
      22:42:12.769 LSTERROR main AbstractTokenTestCase:230 CLASSES arguments may not start with | : |Wizard
      22:42:12.769 LSTERROR main AbstractTokenTestCase:230 CLASSES arguments may not end with | : Wizard|
      22:42:12.769 LSTERROR main AbstractTokenTestCase:230 Non-sensical Skill CLASSES: Contains ! without (or before) ALL: Wizard|!Sorcerer
      22:42:12.772 LSTERROR main AbstractTokenTestCase:230 CLASSES arguments may not start with | : |Wizard
      22:42:12.772 LSTERROR main AbstractTokenTestCase:230 CLASSES arguments may not end with | : Wizard|
      22:42:12.772 LSTERROR main AbstractTokenTestCase:230 Non-sensical Skill CLASSES: Contains ! without (or before) ALL: Wizard|!Sorcerer
      22:42:12.773 LSTERROR main AbstractTokenTestCase:230 Non-sensical Skill CLASSES: Contains ! without (or before) ALL: !Wizard|Sorcerer
      22:42:12.773 LSTERROR main AbstractTokenTestCase:230 CLASSES arguments may not start with | : |Wizard
      22:42:12.774 LSTERROR main AbstractTokenTestCase:230 CLASSES arguments may not end with | : Wizard|
      22:42:12.774 LSTERROR main AbstractTokenTestCase:230 Non-sensical Skill CLASSES: Contains ! without (or before) ALL: Wizard|!Sorcerer
      22:42:12.774 LSTERROR main AbstractTokenTestCase:230 Non-sensical Skill CLASSES: Contains ! without (or before) ALL: !Wizard|Sorcerer
      22:42:12.774 LSTERROR main AbstractTokenTestCase:230 CLASSES arguments uses double separator || : Wizard||Sorcerer
      22:42:12.775 SEVERE main CDOMFactory:116 Unconstructed Reference: ClassSkillList Wizard
      22:42:12.776 SEVERE main CDOMFactory:116 Unconstructed Reference: ClassSkillList Sorcerer
      22:42:12.777 SEVERE main CDOMFactory:116 Unconstructed Reference: ClassSkillList Wizard
      22:42:12.777 LSTERROR main AbstractTokenTestCase:230 CLASSES arguments may not start with | : |Wizard
      22:42:12.777 LSTERROR main AbstractTokenTestCase:230 CLASSES arguments may not end with | : Wizard|
      22:42:12.778 LSTERROR main AbstractTokenTestCase:230 Non-sensical Skill CLASSES: Contains ! without (or before) ALL: Wizard|!Sorcerer
      22:42:12.778 LSTERROR main AbstractTokenTestCase:230 Non-sensical Skill CLASSES: Contains ! without (or before) ALL: !Wizard|Sorcerer
      22:42:12.778 LSTERROR main AbstractTokenTestCase:230 CLASSES arguments uses double separator || : Wizard||Sorcerer
      22:42:12.778 LSTERROR main AbstractTokenTestCase:230 Non-sensical Skill CLASSES: Contains ALL after a specific reference: Wizard|ALL
      22:42:12.779 LSTERROR main AbstractTokenTestCase:230 CLASSES arguments may not start with | : |Wizard
      22:42:12.779 LSTERROR main AbstractTokenTestCase:230 CLASSES arguments may not end with | : Wizard|
      22:42:12.779 LSTERROR main AbstractTokenTestCase:230 Non-sensical Skill CLASSES: Contains ! without (or before) ALL: Wizard|!Sorcerer
      22:42:12.779 LSTERROR main AbstractTokenTestCase:230 Non-sensical Skill CLASSES: Contains ! without (or before) ALL: !Wizard|Sorcerer
      22:42:12.779 LSTERROR main AbstractTokenTestCase:230 CLASSES arguments uses double separator || : Wizard||Sorcerer
      22:42:12.779 LSTERROR main AbstractTokenTestCase:230 Non-sensical Skill CLASSES: Contains ALL after a specific reference: Wizard|ALL
      22:42:12.779 LSTERROR main AbstractTokenTestCase:230 Non-sensical Skill CLASSES: Contains ! without (or before) ALL: !Wizard|ALL
      22:42:12.780 LSTERROR main AbstractTokenTestCase:230 CLASSES arguments may not start with | : |Wizard
      22:42:12.780 LSTERROR main AbstractTokenTestCase:230 CLASSES arguments may not end with | : Wizard|
      22:42:12.780 LSTERROR main AbstractTokenTestCase:230 Non-sensical Skill CLASSES: Contains ! without (or before) ALL: Wizard|!Sorcerer
      22:42:12.781 LSTERROR main AbstractTokenTestCase:230 Non-sensical Skill CLASSES: Contains ! without (or before) ALL: !Wizard|Sorcerer
      22:42:12.781 LSTERROR main AbstractTokenTestCase:230 CLASSES arguments uses double separator || : Wizard||Sorcerer
      22:42:12.781 LSTERROR main AbstractTokenTestCase:230 Non-sensical Skill CLASSES: Contains ALL after a specific reference: Wizard|ALL
      22:42:12.781 LSTERROR main AbstractTokenTestCase:230 Non-sensical Skill CLASSES: Contains ! without (or before) ALL: !Wizard|ALL
      22:42:12.781 LSTERROR main AbstractTokenTestCase:230 Non-sensical Skill CLASSES: Contains ! without (or before) ALL: !ALL
      22:42:12.782 LSTERROR main AbstractTokenTestCase:230 CLASSES arguments may not start with | : |Wizard
      22:42:12.782 LSTERROR main AbstractTokenTestCase:230 CLASSES arguments may not end with | : Wizard|
      22:42:12.782 LSTERROR main AbstractTokenTestCase:230 Non-sensical Skill CLASSES: Contains ! without (or before) ALL: Wizard|!Sorcerer
      22:42:12.782 LSTERROR main AbstractTokenTestCase:230 Non-sensical Skill CLASSES: Contains ! without (or before) ALL: !Wizard|Sorcerer
      22:42:12.782 LSTERROR main AbstractTokenTestCase:230 CLASSES arguments uses double separator || : Wizard||Sorcerer
      22:42:12.783 LSTERROR main AbstractTokenTestCase:230 Non-sensical Skill CLASSES: Contains ALL after a specific reference: Wizard|ALL
      22:42:12.783 LSTERROR main AbstractTokenTestCase:230 Non-sensical Skill CLASSES: Contains ! without (or before) ALL: !Wizard|ALL
      22:42:12.783 LSTERROR main AbstractTokenTestCase:230 Non-sensical Skill CLASSES: Contains ! without (or before) ALL: !ALL
      22:42:12.783 LSTERROR main AbstractTokenTestCase:230 Invalid CLASSES cannot use !ALL
      22:42:12.784 LSTERROR main AbstractTokenTestCase:230 CLASSES arguments may not start with | : |Wizard
      22:42:12.784 LSTERROR main AbstractTokenTestCase:230 CLASSES arguments may not end with | : Wizard|
      22:42:12.784 LSTERROR main AbstractTokenTestCase:230 Non-sensical Skill CLASSES: Contains ! without (or before) ALL: Wizard|!Sorcerer
      22:42:12.784 LSTERROR main AbstractTokenTestCase:230 Non-sensical Skill CLASSES: Contains ! without (or before) ALL: !Wizard|Sorcerer
      22:42:12.784 LSTERROR main AbstractTokenTestCase:230 CLASSES arguments uses double separator || : Wizard||Sorcerer
      22:42:12.784 LSTERROR main AbstractTokenTestCase:230 Non-sensical Skill CLASSES: Contains ALL after a specific reference: Wizard|ALL
      22:42:12.785 LSTERROR main AbstractTokenTestCase:230 Non-sensical Skill CLASSES: Contains ! without (or before) ALL: !Wizard|ALL
      22:42:12.785 LSTERROR main AbstractTokenTestCase:230 Non-sensical Skill CLASSES: Contains ! without (or before) ALL: !ALL
      22:42:12.785 LSTERROR main AbstractTokenTestCase:230 Invalid CLASSES cannot use !ALL
      22:42:12.785 LSTERROR main AbstractTokenTestCase:230 Non-sensical Skill CLASSES: Contains ALL and a specific reference: ALL|Wizard
      Tests run: 21, Failures: 0, Errors: 0, Skipped: 0, Time elapsed: 0.035 sec
      Running plugin.lsttokens.editcontext.template.FaceIntegrationTest
      22:42:12.799 SEVERE main TokenLibrary:150 Duplicate PCTemplate Token found for token FACE
      Tests run: 5, Failures: 0, Errors: 0, Skipped: 0, Time elapsed: 0.015 sec
      Running plugin.lsttokens.race.HitDiceAdvancementTokenTest
      22:42:12.814 SEVERE main TokenLibrary:150 Duplicate Race Token found for token HITDICEADVANCEMENT
      Tests run: 21, Failures: 0, Errors: 0, Skipped: 0, Time elapsed: 0.02 sec
      Running plugin.lsttokens.template.LevelAdjustmentTokenTest
      22:42:12.834 SEVERE main TokenLibrary:150 Duplicate PCTemplate Token found for token LEVELADJUSTMENT
      22:42:12.835 LSTERROR main AbstractTokenTestCase:230 LEVELADJUSTMENT may not have empty argument
      Tests run: 10, Failures: 0, Errors: 0, Skipped: 0, Time elapsed: 0.011 sec
      Running plugin.lsttokens.equipmentmodifier.ArmortypeTokenTest
      22:42:12.846 SEVERE main TokenLibrary:150 Duplicate EquipmentModifier Token found for token ARMORTYPE
      22:42:12.847 LSTERROR main AbstractTokenTestCase:230 ARMORTYPE may not have empty argument
      22:42:12.851 LSTERROR main AbstractTokenTestCase:230 ARMORTYPE may not have empty argument
      22:42:12.851 LSTERROR main AbstractTokenTestCase:230 ARMORTYPE arguments uses double separator || : Light||Medium
      22:42:12.852 LSTERROR main AbstractTokenTestCase:230 ARMORTYPE may not have empty argument
      22:42:12.852 LSTERROR main AbstractTokenTestCase:230 ARMORTYPE arguments uses double separator || : Light||Medium
      22:42:12.852 LSTERROR main AbstractTokenTestCase:230 ARMORTYPE has no PIPE character: Must be of the form old|new
      22:42:12.853 LSTERROR main AbstractTokenTestCase:230 ARMORTYPE may not have empty argument
      22:42:12.853 LSTERROR main AbstractTokenTestCase:230 ARMORTYPE arguments uses double separator || : Light||Medium
      22:42:12.853 LSTERROR main AbstractTokenTestCase:230 ARMORTYPE has no PIPE character: Must be of the form old|new
      22:42:12.853 LSTERROR main AbstractTokenTestCase:230 ARMORTYPE arguments may not end with | : Medium|
      22:42:12.854 LSTERROR main AbstractTokenTestCase:230 ARMORTYPE may not have empty argument
      22:42:12.854 LSTERROR main AbstractTokenTestCase:230 ARMORTYPE arguments uses double separator || : Light||Medium
      22:42:12.854 LSTERROR main AbstractTokenTestCase:230 ARMORTYPE has no PIPE character: Must be of the form old|new
      22:42:12.854 LSTERROR main AbstractTokenTestCase:230 ARMORTYPE arguments may not end with | : Medium|
      22:42:12.854 LSTERROR main AbstractTokenTestCase:230 ARMORTYPE arguments may not start with | : |Medium
      22:42:12.855 LSTERROR main AbstractTokenTestCase:230 ARMORTYPE may not have empty argument
      22:42:12.855 LSTERROR main AbstractTokenTestCase:230 ARMORTYPE arguments uses double separator || : Light||Medium
      22:42:12.855 LSTERROR main AbstractTokenTestCase:230 ARMORTYPE has no PIPE character: Must be of the form old|new
      22:42:12.855 LSTERROR main AbstractTokenTestCase:230 ARMORTYPE arguments may not end with | : Medium|
      22:42:12.855 LSTERROR main AbstractTokenTestCase:230 ARMORTYPE arguments may not start with | : |Medium
      22:42:12.856 LSTERROR main AbstractTokenTestCase:230 ARMORTYPE has too many PIPE characters: Must be of the form old|new
      Tests run: 17, Failures: 0, Errors: 0, Skipped: 0, Time elapsed: 0.017 sec

      Results :

      Tests run: 18917, Failures: 0, Errors: 0, Skipped: 0

      Cobertura: Loaded information on 4079 classes.
      Cobertura: Saved information on 4079 classes.
      [HUDSON] Recording test results
      [INFO] [site:site {execution: default-site}]
      [INFO] Skipped "Surefire Report" report, file "JUnit Test Results.html" already exists for the English version.
      [INFO] Skipped "About" report, file "index.html" already exists for the English version.
      [WARNING] [XHTML Sink] No HTML tag found for unknown event: 'action', ignoring!
      [WARNING] [XHTML Sink] No HTML tag found for unknown event: 'release', ignoring!
      [INFO] Generating "Surefire Report" report.
      [WARNING] Unable to locate Test Source XRef to link to - DISABLED
      [INFO] Generating "Cobertura Test Coverage" report.
      [INFO] Cobertura 1.9.2 - GNU GPL License (NO WARRANTY) - See COPYRIGHT file
      Cobertura: Loaded information on 4079 classes.
      Javancss.<init>(InputStream).e: net.sourceforge.cobertura.javancss.ParseException: Encountered ">" at line 34, column 72.
      Was expecting one of:
      "assert" ...
      "enum" ...
      <IDENTIFIER> ...
      "[" ...

      [cobertura] WARN [main] net.sourceforge.cobertura.reporting.ComplexityCalculator - JavaNCSS got an error while parsing the java file <http://ci.pcgen.org/hudson/job/PCGen%20Nightly%20Build%20(Trunk)/net.sourceforge.pcgen$pcgen/ws/code/src/java/pcgen/cdom/facet/AbstractDataFacet.java>
      ParseException in STDIN
      Last useful checkpoint: "pcgen.cdom.facet.AbstractDataFacet"
      Encountered ">" at line 34, column 72.
      Was expecting one of:
      "assert" ...
      "enum" ...
      <IDENTIFIER> ...
      "[" ...


      Report time: 18465ms

      [INFO] Cobertura Report generation was successful.
      [INFO] Generating "Change Log" report.
      [INFO] Generating changed sets xml to: <http://ci.pcgen.org/hudson/job/PCGen%20Nightly%20Build%20(Trunk)/net.sourceforge.pcgen$pcgen/ws/target/changelog.xml>
      [INFO] Executing: svn --non-interactive log -v -r "{2010-11-12 11:43:11 +0000}:{2011-02-11 11:43:11 +0000}" https://pcgen.svn.sourceforge.net/svnroot/pcgen/Trunk/pcgen
      [INFO] Working directory: <http://ci.pcgen.org/hudson/job/PCGen%20Nightly%20Build%20(Trunk)/net.sourceforge.pcgen$pcgen/ws/>
      [ERROR] Provider message:
      [ERROR] The svn command failed.
      [ERROR] Command output:
      [ERROR] svn: warning: Can't open file '/root/.subversion/servers': Permission denied
      svn: OPTIONS of 'https://pcgen.svn.sourceforge.net/svnroot/pcgen/Trunk/pcgen': Server certificate verification failed: issuer is not trusted (https://pcgen.svn.sourceforge.net)

      [HUDSON] Archiving site from <http://ci.pcgen.org/hudson/job/PCGen%20Nightly%20Build%20(Trunk)/net.sourceforge.pcgen$pcgen/ws/target/site> to /home/tomcat/.hudson/jobs/PCGen Nightly Build (Trunk)/site
      [INFO] ------------------------------------------------------------------------
      [ERROR] BUILD ERROR
      [INFO] ------------------------------------------------------------------------
    • hudson@ci.pcgen.org
      See ... [...truncated 709666 lines...] 23:01:50.837 SEVERE
      Message 2 of 10 , Feb 10, 2011
      • 0 Attachment
        See <http://ci.pcgen.org/hudson/job/PCGen%20Nightly%20Build%20(Trunk)/net.sourceforge.pcgen$pcgen/569/>

        ------------------------------------------
        [...truncated 709666 lines...]
        23:01:50.837 SEVERE main LoadContext:93 !!LEGS must be an integer >= 0
        23:01:50.838 SEVERE main LoadContext:93 !!LEGS must be an integer >= 0
        Tests run: 18, Failures: 0, Errors: 0, Skipped: 0, Time elapsed: 0.055 sec
        Running plugin.lsttokens.campaign.WeaponProfTokenTest
        23:01:50.848 LSTERROR main AbstractTokenTestCase:230 WEAPONPROF may not have empty argument
        23:01:50.851 LSTERROR main AbstractTokenTestCase:230 WEAPONPROF may not have null argument
        23:01:50.853 LSTERROR main AbstractTokenTestCase:230 WEAPONPROF may not have null argument
        23:01:50.853 LSTERROR main AbstractTokenTestCase:230 WEAPONPROF arguments may not end with | : String|
        23:01:50.854 LSTERROR main AbstractTokenTestCase:230 WEAPONPROF may not have null argument
        23:01:50.854 LSTERROR main AbstractTokenTestCase:230 WEAPONPROF arguments may not end with | : String|
        23:01:50.854 LSTERROR main AbstractTokenTestCase:230 WEAPONPROF arguments may not start with | : |String
        23:01:50.857 SEVERE main CampaignSourceEntry:432 Found Suffix in Campaign Source without parenthesis: Parens required around INCLUDE/EXCLUDE
        23:01:50.857 SEVERE main CampaignSourceEntry:435 Found: 'Other' in String|Other
        23:01:50.858 LSTERROR main AbstractTokenTestCase:230 WEAPONPROF may not have null argument
        23:01:50.858 LSTERROR main AbstractTokenTestCase:230 WEAPONPROF arguments may not end with | : String|
        23:01:50.860 LSTERROR main AbstractTokenTestCase:230 WEAPONPROF arguments may not start with | : |String
        23:01:50.860 LSTERROR main AbstractTokenTestCase:230 Internal error.
        23:01:50.861 SEVERE main CampaignSourceEntry:432 Found Suffix in Campaign Source without parenthesis: Parens required around INCLUDE/EXCLUDE
        23:01:50.862 SEVERE main CampaignSourceEntry:435 Found: 'INCLUDE:Incl' in String|INCLUDE:Incl
        23:01:50.862 LSTERROR main AbstractTokenTestCase:230 WEAPONPROF may not have null argument
        23:01:50.862 LSTERROR main AbstractTokenTestCase:230 WEAPONPROF arguments may not end with | : String|
        23:01:50.862 LSTERROR main AbstractTokenTestCase:230 WEAPONPROF arguments may not start with | : |String
        23:01:50.862 LSTERROR main AbstractTokenTestCase:230 Internal error.
        23:01:50.862 LSTERROR main AbstractTokenTestCase:230 Internal error.
        23:01:50.864 SEVERE main CampaignSourceEntry:442 Found Suffix in Campaign Source with multiple parenthesis: Single set of parens required around INCLUDE/EXCLUDE
        23:01:50.864 SEVERE main CampaignSourceEntry:445 Found: '((INCLUDE:Incl))' in String|((INCLUDE:Incl))
        23:01:50.864 LSTERROR main AbstractTokenTestCase:230 WEAPONPROF may not have null argument
        23:01:50.864 LSTERROR main AbstractTokenTestCase:230 WEAPONPROF arguments may not end with | : String|
        23:01:50.864 LSTERROR main AbstractTokenTestCase:230 WEAPONPROF arguments may not start with | : |String
        23:01:50.864 LSTERROR main AbstractTokenTestCase:230 Internal error.
        23:01:50.865 LSTERROR main AbstractTokenTestCase:230 Internal error.
        23:01:50.865 LSTERROR main AbstractTokenTestCase:230 Internal error.
        23:01:50.866 SEVERE main CampaignSourceEntry:505 Must Specify Items after :
        23:01:50.866 LSTERROR main AbstractTokenTestCase:230 WEAPONPROF may not have null argument
        23:01:50.866 LSTERROR main AbstractTokenTestCase:230 WEAPONPROF arguments may not end with | : String|
        23:01:50.867 LSTERROR main AbstractTokenTestCase:230 WEAPONPROF arguments may not start with | : |String
        23:01:50.867 LSTERROR main AbstractTokenTestCase:230 Internal error.
        23:01:50.867 LSTERROR main AbstractTokenTestCase:230 Internal error.
        23:01:50.867 LSTERROR main AbstractTokenTestCase:230 Internal error.
        23:01:50.867 LSTERROR main AbstractTokenTestCase:230 Internal error.
        23:01:50.868 LSTERROR main CampaignSourceEntry:531 Invalid INCLUDE value on String in TestObj. Abilities must always have categories (e.g. INCLUDE:CATEGORY=cat1,key1,key2|CATEGORY=cat2,key1 ) and other file types should never have categories (e.g. INCLUDE:key1|key2 ).
        23:01:50.869 LSTERROR main AbstractTokenTestCase:230 WEAPONPROF may not have null argument
        23:01:50.869 LSTERROR main AbstractTokenTestCase:230 WEAPONPROF arguments may not end with | : String|
        23:01:50.869 LSTERROR main AbstractTokenTestCase:230 WEAPONPROF arguments may not start with | : |String
        23:01:50.869 LSTERROR main AbstractTokenTestCase:230 Internal error.
        23:01:50.869 LSTERROR main AbstractTokenTestCase:230 Internal error.
        23:01:50.869 LSTERROR main AbstractTokenTestCase:230 Internal error.
        23:01:50.869 LSTERROR main AbstractTokenTestCase:230 Internal error.
        23:01:50.870 LSTERROR main AbstractTokenTestCase:230 Internal error.
        23:01:50.871 SEVERE main CampaignSourceEntry:432 Found Suffix in Campaign Source without parenthesis: Parens required around INCLUDE/EXCLUDE
        23:01:50.871 SEVERE main CampaignSourceEntry:435 Found: 'EXCLUDE:Incl' in String|EXCLUDE:Incl
        23:01:50.871 LSTERROR main AbstractTokenTestCase:230 WEAPONPROF may not have null argument
        23:01:50.871 LSTERROR main AbstractTokenTestCase:230 WEAPONPROF arguments may not end with | : String|
        23:01:50.871 LSTERROR main AbstractTokenTestCase:230 WEAPONPROF arguments may not start with | : |String
        23:01:50.872 LSTERROR main AbstractTokenTestCase:230 Internal error.
        23:01:50.872 LSTERROR main AbstractTokenTestCase:230 Internal error.
        23:01:50.872 LSTERROR main AbstractTokenTestCase:230 Internal error.
        23:01:50.872 LSTERROR main AbstractTokenTestCase:230 Internal error.
        23:01:50.872 LSTERROR main AbstractTokenTestCase:230 Internal error.
        23:01:50.872 LSTERROR main AbstractTokenTestCase:230 Internal error.
        23:01:50.873 SEVERE main CampaignSourceEntry:442 Found Suffix in Campaign Source with multiple parenthesis: Single set of parens required around INCLUDE/EXCLUDE
        23:01:50.873 SEVERE main CampaignSourceEntry:445 Found: '((EXCLUDE:Incl))' in String|((EXCLUDE:Incl))
        23:01:50.874 LSTERROR main AbstractTokenTestCase:230 WEAPONPROF may not have null argument
        23:01:50.874 LSTERROR main AbstractTokenTestCase:230 WEAPONPROF arguments may not end with | : String|
        23:01:50.874 LSTERROR main AbstractTokenTestCase:230 WEAPONPROF arguments may not start with | : |String
        23:01:50.874 LSTERROR main AbstractTokenTestCase:230 Internal error.
        23:01:50.874 LSTERROR main AbstractTokenTestCase:230 Internal error.
        23:01:50.874 LSTERROR main AbstractTokenTestCase:230 Internal error.
        23:01:50.875 LSTERROR main AbstractTokenTestCase:230 Internal error.
        23:01:50.875 LSTERROR main AbstractTokenTestCase:230 Internal error.
        23:01:50.875 LSTERROR main AbstractTokenTestCase:230 Internal error.
        23:01:50.875 LSTERROR main AbstractTokenTestCase:230 Internal error.
        23:01:50.876 SEVERE main CampaignSourceEntry:505 Must Specify Items after :
        23:01:50.876 LSTERROR main AbstractTokenTestCase:230 WEAPONPROF may not have null argument
        23:01:50.876 LSTERROR main AbstractTokenTestCase:230 WEAPONPROF arguments may not end with | : String|
        23:01:50.876 LSTERROR main AbstractTokenTestCase:230 WEAPONPROF arguments may not start with | : |String
        23:01:50.877 LSTERROR main AbstractTokenTestCase:230 Internal error.
        23:01:50.877 LSTERROR main AbstractTokenTestCase:230 Internal error.
        23:01:50.877 LSTERROR main AbstractTokenTestCase:230 Internal error.
        23:01:50.877 LSTERROR main AbstractTokenTestCase:230 Internal error.
        23:01:50.877 LSTERROR main AbstractTokenTestCase:230 Internal error.
        23:01:50.877 LSTERROR main AbstractTokenTestCase:230 Internal error.
        23:01:50.877 LSTERROR main AbstractTokenTestCase:230 Internal error.
        23:01:50.878 LSTERROR main AbstractTokenTestCase:230 Internal error.
        23:01:50.881 LSTERROR main CampaignSourceEntry:531 Invalid EXCLUDE value on String in TestObj. Abilities must always have categories (e.g. EXCLUDE:CATEGORY=cat1,key1,key2|CATEGORY=cat2,key1 ) and other file types should never have categories (e.g. EXCLUDE:key1|key2 ).
        23:01:50.881 LSTERROR main AbstractTokenTestCase:230 WEAPONPROF may not have null argument
        23:01:50.881 LSTERROR main AbstractTokenTestCase:230 WEAPONPROF arguments may not end with | : String|
        23:01:50.881 LSTERROR main AbstractTokenTestCase:230 WEAPONPROF arguments may not start with | : |String
        23:01:50.881 LSTERROR main AbstractTokenTestCase:230 Internal error.
        23:01:50.881 LSTERROR main AbstractTokenTestCase:230 Internal error.
        23:01:50.882 LSTERROR main AbstractTokenTestCase:230 Internal error.
        23:01:50.882 LSTERROR main AbstractTokenTestCase:230 Internal error.
        23:01:50.882 LSTERROR main AbstractTokenTestCase:230 Internal error.
        23:01:50.882 LSTERROR main AbstractTokenTestCase:230 Internal error.
        23:01:50.882 LSTERROR main AbstractTokenTestCase:230 Internal error.
        23:01:50.882 LSTERROR main AbstractTokenTestCase:230 Internal error.
        23:01:50.882 LSTERROR main AbstractTokenTestCase:230 Internal error.
        Tests run: 24, Failures: 0, Errors: 0, Skipped: 0, Time elapsed: 0.055 sec
        Running actor.choose.SpellsTokenTest
        Tests run: 3, Failures: 0, Errors: 0, Skipped: 0, Time elapsed: 0.002 sec
        Running plugin.lsttokens.skill.ClassesTokenTest
        23:01:50.902 SEVERE main TokenLibrary:150 Duplicate Skill Token found for token CLASSES
        23:01:50.902 LSTERROR main AbstractTokenTestCase:230 CLASSES may not have empty argument
        23:01:50.906 LSTERROR main AbstractTokenTestCase:230 CLASSES arguments may not start with | : |Wizard
        23:01:50.907 LSTERROR main AbstractTokenTestCase:230 CLASSES arguments may not start with | : |Wizard
        23:01:50.907 LSTERROR main AbstractTokenTestCase:230 CLASSES arguments may not end with | : Wizard|
        23:01:50.908 LSTERROR main AbstractTokenTestCase:230 CLASSES arguments may not start with | : |Wizard
        23:01:50.908 LSTERROR main AbstractTokenTestCase:230 CLASSES arguments may not end with | : Wizard|
        23:01:50.908 LSTERROR main AbstractTokenTestCase:230 Non-sensical Skill CLASSES: Contains ! without (or before) ALL: Wizard|!Sorcerer
        23:01:50.909 LSTERROR main AbstractTokenTestCase:230 CLASSES arguments may not start with | : |Wizard
        23:01:50.909 LSTERROR main AbstractTokenTestCase:230 CLASSES arguments may not end with | : Wizard|
        23:01:50.909 LSTERROR main AbstractTokenTestCase:230 Non-sensical Skill CLASSES: Contains ! without (or before) ALL: Wizard|!Sorcerer
        23:01:50.910 LSTERROR main AbstractTokenTestCase:230 Non-sensical Skill CLASSES: Contains ! without (or before) ALL: !Wizard|Sorcerer
        23:01:50.910 LSTERROR main AbstractTokenTestCase:230 CLASSES arguments may not start with | : |Wizard
        23:01:50.910 LSTERROR main AbstractTokenTestCase:230 CLASSES arguments may not end with | : Wizard|
        23:01:50.911 LSTERROR main AbstractTokenTestCase:230 Non-sensical Skill CLASSES: Contains ! without (or before) ALL: Wizard|!Sorcerer
        23:01:50.911 LSTERROR main AbstractTokenTestCase:230 Non-sensical Skill CLASSES: Contains ! without (or before) ALL: !Wizard|Sorcerer
        23:01:50.911 LSTERROR main AbstractTokenTestCase:230 CLASSES arguments uses double separator || : Wizard||Sorcerer
        23:01:50.912 SEVERE main CDOMFactory:116 Unconstructed Reference: ClassSkillList Wizard
        23:01:50.913 SEVERE main CDOMFactory:116 Unconstructed Reference: ClassSkillList Sorcerer
        23:01:50.914 SEVERE main CDOMFactory:116 Unconstructed Reference: ClassSkillList Wizard
        23:01:50.914 LSTERROR main AbstractTokenTestCase:230 CLASSES arguments may not start with | : |Wizard
        23:01:50.915 LSTERROR main AbstractTokenTestCase:230 CLASSES arguments may not end with | : Wizard|
        23:01:50.915 LSTERROR main AbstractTokenTestCase:230 Non-sensical Skill CLASSES: Contains ! without (or before) ALL: Wizard|!Sorcerer
        23:01:50.915 LSTERROR main AbstractTokenTestCase:230 Non-sensical Skill CLASSES: Contains ! without (or before) ALL: !Wizard|Sorcerer
        23:01:50.915 LSTERROR main AbstractTokenTestCase:230 CLASSES arguments uses double separator || : Wizard||Sorcerer
        23:01:50.915 LSTERROR main AbstractTokenTestCase:230 Non-sensical Skill CLASSES: Contains ALL after a specific reference: Wizard|ALL
        23:01:50.916 LSTERROR main AbstractTokenTestCase:230 CLASSES arguments may not start with | : |Wizard
        23:01:50.916 LSTERROR main AbstractTokenTestCase:230 CLASSES arguments may not end with | : Wizard|
        23:01:50.916 LSTERROR main AbstractTokenTestCase:230 Non-sensical Skill CLASSES: Contains ! without (or before) ALL: Wizard|!Sorcerer
        23:01:50.916 LSTERROR main AbstractTokenTestCase:230 Non-sensical Skill CLASSES: Contains ! without (or before) ALL: !Wizard|Sorcerer
        23:01:50.916 LSTERROR main AbstractTokenTestCase:230 CLASSES arguments uses double separator || : Wizard||Sorcerer
        23:01:50.917 LSTERROR main AbstractTokenTestCase:230 Non-sensical Skill CLASSES: Contains ALL after a specific reference: Wizard|ALL
        23:01:50.917 LSTERROR main AbstractTokenTestCase:230 Non-sensical Skill CLASSES: Contains ! without (or before) ALL: !Wizard|ALL
        23:01:50.917 LSTERROR main AbstractTokenTestCase:230 CLASSES arguments may not start with | : |Wizard
        23:01:50.918 LSTERROR main AbstractTokenTestCase:230 CLASSES arguments may not end with | : Wizard|
        23:01:50.918 LSTERROR main AbstractTokenTestCase:230 Non-sensical Skill CLASSES: Contains ! without (or before) ALL: Wizard|!Sorcerer
        23:01:50.918 LSTERROR main AbstractTokenTestCase:230 Non-sensical Skill CLASSES: Contains ! without (or before) ALL: !Wizard|Sorcerer
        23:01:50.918 LSTERROR main AbstractTokenTestCase:230 CLASSES arguments uses double separator || : Wizard||Sorcerer
        23:01:50.918 LSTERROR main AbstractTokenTestCase:230 Non-sensical Skill CLASSES: Contains ALL after a specific reference: Wizard|ALL
        23:01:50.918 LSTERROR main AbstractTokenTestCase:230 Non-sensical Skill CLASSES: Contains ! without (or before) ALL: !Wizard|ALL
        23:01:50.918 LSTERROR main AbstractTokenTestCase:230 Non-sensical Skill CLASSES: Contains ! without (or before) ALL: !ALL
        23:01:50.921 LSTERROR main AbstractTokenTestCase:230 CLASSES arguments may not start with | : |Wizard
        23:01:50.921 LSTERROR main AbstractTokenTestCase:230 CLASSES arguments may not end with | : Wizard|
        23:01:50.922 LSTERROR main AbstractTokenTestCase:230 Non-sensical Skill CLASSES: Contains ! without (or before) ALL: Wizard|!Sorcerer
        23:01:50.922 LSTERROR main AbstractTokenTestCase:230 Non-sensical Skill CLASSES: Contains ! without (or before) ALL: !Wizard|Sorcerer
        23:01:50.922 LSTERROR main AbstractTokenTestCase:230 CLASSES arguments uses double separator || : Wizard||Sorcerer
        23:01:50.922 LSTERROR main AbstractTokenTestCase:230 Non-sensical Skill CLASSES: Contains ALL after a specific reference: Wizard|ALL
        23:01:50.922 LSTERROR main AbstractTokenTestCase:230 Non-sensical Skill CLASSES: Contains ! without (or before) ALL: !Wizard|ALL
        23:01:50.922 LSTERROR main AbstractTokenTestCase:230 Non-sensical Skill CLASSES: Contains ! without (or before) ALL: !ALL
        23:01:50.922 LSTERROR main AbstractTokenTestCase:230 Invalid CLASSES cannot use !ALL
        23:01:50.923 LSTERROR main AbstractTokenTestCase:230 CLASSES arguments may not start with | : |Wizard
        23:01:50.923 LSTERROR main AbstractTokenTestCase:230 CLASSES arguments may not end with | : Wizard|
        23:01:50.923 LSTERROR main AbstractTokenTestCase:230 Non-sensical Skill CLASSES: Contains ! without (or before) ALL: Wizard|!Sorcerer
        23:01:50.924 LSTERROR main AbstractTokenTestCase:230 Non-sensical Skill CLASSES: Contains ! without (or before) ALL: !Wizard|Sorcerer
        23:01:50.924 LSTERROR main AbstractTokenTestCase:230 CLASSES arguments uses double separator || : Wizard||Sorcerer
        23:01:50.924 LSTERROR main AbstractTokenTestCase:230 Non-sensical Skill CLASSES: Contains ALL after a specific reference: Wizard|ALL
        23:01:50.924 LSTERROR main AbstractTokenTestCase:230 Non-sensical Skill CLASSES: Contains ! without (or before) ALL: !Wizard|ALL
        23:01:50.924 LSTERROR main AbstractTokenTestCase:230 Non-sensical Skill CLASSES: Contains ! without (or before) ALL: !ALL
        23:01:50.924 LSTERROR main AbstractTokenTestCase:230 Invalid CLASSES cannot use !ALL
        23:01:50.924 LSTERROR main AbstractTokenTestCase:230 Non-sensical Skill CLASSES: Contains ALL and a specific reference: ALL|Wizard
        Tests run: 21, Failures: 0, Errors: 0, Skipped: 0, Time elapsed: 0.037 sec
        Running plugin.lsttokens.editcontext.template.FaceIntegrationTest
        23:01:50.940 SEVERE main TokenLibrary:150 Duplicate PCTemplate Token found for token FACE
        Tests run: 5, Failures: 0, Errors: 0, Skipped: 0, Time elapsed: 0.014 sec
        Running plugin.lsttokens.race.HitDiceAdvancementTokenTest
        23:01:50.952 SEVERE main TokenLibrary:150 Duplicate Race Token found for token HITDICEADVANCEMENT
        Tests run: 21, Failures: 0, Errors: 0, Skipped: 0, Time elapsed: 0.018 sec
        Running plugin.lsttokens.template.LevelAdjustmentTokenTest
        23:01:50.970 SEVERE main TokenLibrary:150 Duplicate PCTemplate Token found for token LEVELADJUSTMENT
        23:01:50.971 LSTERROR main AbstractTokenTestCase:230 LEVELADJUSTMENT may not have empty argument
        Tests run: 10, Failures: 0, Errors: 0, Skipped: 0, Time elapsed: 0.01 sec
        Running plugin.lsttokens.equipmentmodifier.ArmortypeTokenTest
        23:01:50.981 SEVERE main TokenLibrary:150 Duplicate EquipmentModifier Token found for token ARMORTYPE
        23:01:50.982 LSTERROR main AbstractTokenTestCase:230 ARMORTYPE may not have empty argument
        23:01:50.986 LSTERROR main AbstractTokenTestCase:230 ARMORTYPE may not have empty argument
        23:01:50.986 LSTERROR main AbstractTokenTestCase:230 ARMORTYPE arguments uses double separator || : Light||Medium
        23:01:50.987 LSTERROR main AbstractTokenTestCase:230 ARMORTYPE may not have empty argument
        23:01:50.987 LSTERROR main AbstractTokenTestCase:230 ARMORTYPE arguments uses double separator || : Light||Medium
        23:01:50.987 LSTERROR main AbstractTokenTestCase:230 ARMORTYPE has no PIPE character: Must be of the form old|new
        23:01:50.988 LSTERROR main AbstractTokenTestCase:230 ARMORTYPE may not have empty argument
        23:01:50.988 LSTERROR main AbstractTokenTestCase:230 ARMORTYPE arguments uses double separator || : Light||Medium
        23:01:50.988 LSTERROR main AbstractTokenTestCase:230 ARMORTYPE has no PIPE character: Must be of the form old|new
        23:01:50.988 LSTERROR main AbstractTokenTestCase:230 ARMORTYPE arguments may not end with | : Medium|
        23:01:50.989 LSTERROR main AbstractTokenTestCase:230 ARMORTYPE may not have empty argument
        23:01:50.989 LSTERROR main AbstractTokenTestCase:230 ARMORTYPE arguments uses double separator || : Light||Medium
        23:01:50.989 LSTERROR main AbstractTokenTestCase:230 ARMORTYPE has no PIPE character: Must be of the form old|new
        23:01:50.989 LSTERROR main AbstractTokenTestCase:230 ARMORTYPE arguments may not end with | : Medium|
        23:01:50.989 LSTERROR main AbstractTokenTestCase:230 ARMORTYPE arguments may not start with | : |Medium
        23:01:50.990 LSTERROR main AbstractTokenTestCase:230 ARMORTYPE may not have empty argument
        23:01:50.990 LSTERROR main AbstractTokenTestCase:230 ARMORTYPE arguments uses double separator || : Light||Medium
        23:01:50.990 LSTERROR main AbstractTokenTestCase:230 ARMORTYPE has no PIPE character: Must be of the form old|new
        23:01:50.991 LSTERROR main AbstractTokenTestCase:230 ARMORTYPE arguments may not end with | : Medium|
        23:01:50.991 LSTERROR main AbstractTokenTestCase:230 ARMORTYPE arguments may not start with | : |Medium
        23:01:50.991 LSTERROR main AbstractTokenTestCase:230 ARMORTYPE has too many PIPE characters: Must be of the form old|new
        Tests run: 17, Failures: 0, Errors: 0, Skipped: 0, Time elapsed: 0.018 sec

        Results :

        Tests run: 18917, Failures: 0, Errors: 0, Skipped: 0

        Cobertura: Loaded information on 4079 classes.
        Cobertura: Saved information on 4079 classes.
        [HUDSON] Recording test results
        [INFO] [site:site {execution: default-site}]
        [INFO] Skipped "Surefire Report" report, file "JUnit Test Results.html" already exists for the English version.
        [INFO] Skipped "About" report, file "index.html" already exists for the English version.
        [WARNING] [XHTML Sink] No HTML tag found for unknown event: 'action', ignoring!
        [WARNING] [XHTML Sink] No HTML tag found for unknown event: 'release', ignoring!
        [INFO] Generating "Surefire Report" report.
        [WARNING] Unable to locate Test Source XRef to link to - DISABLED
        [INFO] Generating "Cobertura Test Coverage" report.
        [INFO] Cobertura 1.9.2 - GNU GPL License (NO WARRANTY) - See COPYRIGHT file
        Cobertura: Loaded information on 4079 classes.
        Javancss.<init>(InputStream).e: net.sourceforge.cobertura.javancss.ParseException: Encountered ">" at line 34, column 72.
        Was expecting one of:
        "assert" ...
        "enum" ...
        <IDENTIFIER> ...
        "[" ...

        [cobertura] WARN [main] net.sourceforge.cobertura.reporting.ComplexityCalculator - JavaNCSS got an error while parsing the java file <http://ci.pcgen.org/hudson/job/PCGen%20Nightly%20Build%20(Trunk)/net.sourceforge.pcgen$pcgen/ws/code/src/java/pcgen/cdom/facet/AbstractDataFacet.java>
        ParseException in STDIN
        Last useful checkpoint: "pcgen.cdom.facet.AbstractDataFacet"
        Encountered ">" at line 34, column 72.
        Was expecting one of:
        "assert" ...
        "enum" ...
        <IDENTIFIER> ...
        "[" ...


        Report time: 19420ms

        [INFO] Cobertura Report generation was successful.
        [INFO] Generating "Change Log" report.
        [INFO] Generating changed sets xml to: <http://ci.pcgen.org/hudson/job/PCGen%20Nightly%20Build%20(Trunk)/net.sourceforge.pcgen$pcgen/ws/target/changelog.xml>
        [INFO] Executing: svn --non-interactive log -v -r "{2010-11-12 12:03:04 +0000}:{2011-02-11 12:03:04 +0000}" https://pcgen.svn.sourceforge.net/svnroot/pcgen/Trunk/pcgen
        [INFO] Working directory: <http://ci.pcgen.org/hudson/job/PCGen%20Nightly%20Build%20(Trunk)/net.sourceforge.pcgen$pcgen/ws/>
        [ERROR] Provider message:
        [ERROR] The svn command failed.
        [ERROR] Command output:
        [ERROR] svn: warning: Can't open file '/root/.subversion/servers': Permission denied
        svn: OPTIONS of 'https://pcgen.svn.sourceforge.net/svnroot/pcgen/Trunk/pcgen': Server certificate verification failed: issuer is not trusted (https://pcgen.svn.sourceforge.net)

        [HUDSON] Archiving site from <http://ci.pcgen.org/hudson/job/PCGen%20Nightly%20Build%20(Trunk)/net.sourceforge.pcgen$pcgen/ws/target/site> to /home/tomcat/.hudson/jobs/PCGen Nightly Build (Trunk)/site
        [INFO] ------------------------------------------------------------------------
        [ERROR] BUILD ERROR
        [INFO] ------------------------------------------------------------------------
      • hudson@ci.pcgen.org
        See
        Message 3 of 10 , Feb 10, 2011
        • 0 Attachment
          See <http://ci.pcgen.org/hudson/job/PCGen%20Nightly%20Build%20(Trunk)/net.sourceforge.pcgen$pcgen/570/changes>
        Your message has been successfully submitted and would be delivered to recipients shortly.