Loading ...
Sorry, an error occurred while loading the content.

Build failed in Hudson: PCGen Ni ghtly Build (Trunk) » PCGen #379

Expand Messages
  • hudson@ci.pcgen.org
    See ... [...truncated 367534 lines...] 22:09:07.300
    Message 1 of 19 , Jul 24, 2010
    • 0 Attachment
      See <http://ci.pcgen.org/hudson/job/PCGen%20Nightly%20Build%20(Trunk)/net.sourceforge.pcgen$pcgen/379/>

      ------------------------------------------
      [...truncated 367534 lines...]
      22:09:07.300 LSTERROR main AbstractTokenTestCase:224 Failed in parsing subtoken: SPELLCASTER of TYPE=One.
      22:09:07.300 LSTERROR main AbstractTokenTestCase:224 Illegal ADD subtoken 'SPELLCASTER' 'TYPE=One.' for TestObj
      22:09:07.300 LSTERROR main AbstractTokenTestCase:224 Error was encountered while parsing ADD:SPELLCASTER: TYPE=One..Two is not a valid reference: TYPE=One..Two
      22:09:07.300 LSTERROR main AbstractTokenTestCase:224 Failed in parsing subtoken: SPELLCASTER of TYPE=One..Two
      22:09:07.300 LSTERROR main AbstractTokenTestCase:224 Illegal ADD subtoken 'SPELLCASTER' 'TYPE=One..Two' for TestObj
      22:09:07.300 LSTERROR main AbstractTokenTestCase:224 Error was encountered while parsing ADD:SPELLCASTER: TYPE=.One is not a valid reference: TYPE=.One
      22:09:07.300 LSTERROR main AbstractTokenTestCase:224 Failed in parsing subtoken: SPELLCASTER of TYPE=.One
      22:09:07.301 LSTERROR main AbstractTokenTestCase:224 Illegal ADD subtoken 'SPELLCASTER' 'TYPE=.One' for TestObj
      22:09:07.301 LSTERROR main AbstractTokenTestCase:224 SPELLCASTER arguments may not end with , : TestWP1,
      22:09:07.301 LSTERROR main AbstractTokenTestCase:224 Failed in parsing subtoken: SPELLCASTER of TestWP1,
      22:09:07.301 LSTERROR main AbstractTokenTestCase:224 Illegal ADD subtoken 'SPELLCASTER' 'TestWP1,' for TestObj
      22:09:07.301 LSTERROR main AbstractTokenTestCase:224 SPELLCASTER arguments may not start with , : ,TestWP1
      22:09:07.301 LSTERROR main AbstractTokenTestCase:224 Failed in parsing subtoken: SPELLCASTER of ,TestWP1
      22:09:07.301 LSTERROR main AbstractTokenTestCase:224 Illegal ADD subtoken 'SPELLCASTER' ',TestWP1' for TestObj
      22:09:07.302 LSTERROR main AbstractTokenTestCase:224 SPELLCASTER arguments uses double separator ,, : TestWP2,,TestWP1
      22:09:07.302 LSTERROR main AbstractTokenTestCase:224 Failed in parsing subtoken: SPELLCASTER of TestWP2,,TestWP1
      22:09:07.302 LSTERROR main AbstractTokenTestCase:224 Illegal ADD subtoken 'SPELLCASTER' 'TestWP2,,TestWP1' for TestObj
      22:09:07.304 SEVERE main AbstractReferenceManufacturer:992 Unconstructed Reference: PCClass TestWP2
      22:09:07.306 SEVERE main AbstractReferenceManufacturer:992 Unconstructed Reference: PCClass TestWP2
      22:09:07.307 SEVERE main AbstractReferenceManufacturer:992 Unconstructed Reference: PCClass TestWP2
      22:09:07.337 LSTERROR main AbstractTokenTestCase:224 Non-sensical ADD:SPELLCASTER: Contains ANY and a specific reference: ANY,TYPE=TestType
      22:09:07.338 LSTERROR main AbstractTokenTestCase:224 Failed in parsing subtoken: SPELLCASTER of ANY,TYPE=TestType
      22:09:07.338 LSTERROR main AbstractTokenTestCase:224 Illegal ADD subtoken 'SPELLCASTER' 'ANY,TYPE=TestType' for TestObj
      22:09:07.339 LSTERROR main AbstractTokenTestCase:224 Non-sensical ADD:SPELLCASTER: Contains ANY and a specific reference: ANY,TYPE=TestType
      22:09:07.340 LSTERROR main AbstractTokenTestCase:224 Failed in parsing subtoken: SPELLCASTER of ANY,TYPE=TestType
      22:09:07.340 LSTERROR main AbstractTokenTestCase:224 Illegal ADD subtoken 'SPELLCASTER' 'ANY,TYPE=TestType' for TestObj
      22:09:07.340 LSTERROR main AbstractTokenTestCase:224 Non-sensical ADD:SPELLCASTER: Contains ANY and a specific reference: TYPE=TestType,ANY
      22:09:07.340 LSTERROR main AbstractTokenTestCase:224 Failed in parsing subtoken: SPELLCASTER of TYPE=TestType,ANY
      22:09:07.340 LSTERROR main AbstractTokenTestCase:224 Illegal ADD subtoken 'SPELLCASTER' 'TYPE=TestType,ANY' for TestObj
      22:09:07.343 SEVERE main TokenUtilities:68 Type may not be empty in:
      22:09:07.344 LSTERROR main AbstractTokenTestCase:224 Non-sensical ADD:SPELLCASTER: Contains ANY and a specific reference: ANY,TYPE=TestType
      22:09:07.344 LSTERROR main AbstractTokenTestCase:224 Failed in parsing subtoken: SPELLCASTER of ANY,TYPE=TestType
      22:09:07.344 LSTERROR main AbstractTokenTestCase:224 Illegal ADD subtoken 'SPELLCASTER' 'ANY,TYPE=TestType' for TestObj
      22:09:07.344 LSTERROR main AbstractTokenTestCase:224 Non-sensical ADD:SPELLCASTER: Contains ANY and a specific reference: TYPE=TestType,ANY
      22:09:07.344 LSTERROR main AbstractTokenTestCase:224 Failed in parsing subtoken: SPELLCASTER of TYPE=TestType,ANY
      22:09:07.345 LSTERROR main AbstractTokenTestCase:224 Illegal ADD subtoken 'SPELLCASTER' 'TYPE=TestType,ANY' for TestObj
      22:09:07.345 LSTERROR main AbstractTokenTestCase:224 Error was encountered while parsing ADD:SPELLCASTER: TYPE= is not a valid reference: TestWP3,TYPE=
      22:09:07.345 LSTERROR main AbstractTokenTestCase:224 Failed in parsing subtoken: SPELLCASTER of TestWP3,TYPE=
      22:09:07.345 LSTERROR main AbstractTokenTestCase:224 Illegal ADD subtoken 'SPELLCASTER' 'TestWP3,TYPE=' for TestObj
      22:09:07.459 LSTERROR main AbstractTokenTestCase:224 Non-sensical ADD:SPELLCASTER: Contains ANY and a specific reference: ANY,TYPE=TestType
      22:09:07.460 LSTERROR main AbstractTokenTestCase:224 Failed in parsing subtoken: SPELLCASTER of ANY,TYPE=TestType
      22:09:07.460 LSTERROR main AbstractTokenTestCase:224 Illegal ADD subtoken 'SPELLCASTER' 'ANY,TYPE=TestType' for TestObj
      22:09:07.460 LSTERROR main AbstractTokenTestCase:224 Non-sensical ADD:SPELLCASTER: Contains ANY and a specific reference: TYPE=TestType,ANY
      22:09:07.460 LSTERROR main AbstractTokenTestCase:224 Failed in parsing subtoken: SPELLCASTER of TYPE=TestType,ANY
      22:09:07.460 LSTERROR main AbstractTokenTestCase:224 Illegal ADD subtoken 'SPELLCASTER' 'TYPE=TestType,ANY' for TestObj
      22:09:07.460 LSTERROR main AbstractTokenTestCase:224 Error was encountered while parsing ADD:SPELLCASTER: TYPE= is not a valid reference: TestWP3,TYPE=
      22:09:07.460 LSTERROR main AbstractTokenTestCase:224 Failed in parsing subtoken: SPELLCASTER of TestWP3,TYPE=
      22:09:07.461 LSTERROR main AbstractTokenTestCase:224 Illegal ADD subtoken 'SPELLCASTER' 'TestWP3,TYPE=' for TestObj
      22:09:07.461 LSTERROR main AbstractTokenTestCase:224 SPELLCASTER arguments uses double separator ,, : TestWP3,,TestWP4
      22:09:07.461 LSTERROR main AbstractTokenTestCase:224 Failed in parsing subtoken: SPELLCASTER of TestWP3,,TestWP4
      22:09:07.461 LSTERROR main AbstractTokenTestCase:224 Illegal ADD subtoken 'SPELLCASTER' 'TestWP3,,TestWP4' for TestObj
      22:09:07.465 LSTERROR main AbstractTokenTestCase:224 Non-sensical ADD:SPELLCASTER: Contains ANY and a specific reference: ANY,TYPE=TestType
      22:09:07.465 LSTERROR main AbstractTokenTestCase:224 Failed in parsing subtoken: SPELLCASTER of ANY,TYPE=TestType
      22:09:07.465 LSTERROR main AbstractTokenTestCase:224 Illegal ADD subtoken 'SPELLCASTER' 'ANY,TYPE=TestType' for TestObj
      22:09:07.465 LSTERROR main AbstractTokenTestCase:224 Non-sensical ADD:SPELLCASTER: Contains ANY and a specific reference: TYPE=TestType,ANY
      22:09:07.465 LSTERROR main AbstractTokenTestCase:224 Failed in parsing subtoken: SPELLCASTER of TYPE=TestType,ANY
      22:09:07.465 LSTERROR main AbstractTokenTestCase:224 Illegal ADD subtoken 'SPELLCASTER' 'TYPE=TestType,ANY' for TestObj
      22:09:07.466 LSTERROR main AbstractTokenTestCase:224 Error was encountered while parsing ADD:SPELLCASTER: TYPE= is not a valid reference: TestWP3,TYPE=
      22:09:07.466 LSTERROR main AbstractTokenTestCase:224 Failed in parsing subtoken: SPELLCASTER of TestWP3,TYPE=
      22:09:07.466 LSTERROR main AbstractTokenTestCase:224 Illegal ADD subtoken 'SPELLCASTER' 'TestWP3,TYPE=' for TestObj
      22:09:07.466 LSTERROR main AbstractTokenTestCase:224 SPELLCASTER arguments uses double separator ,, : TestWP3,,TestWP4
      22:09:07.466 LSTERROR main AbstractTokenTestCase:224 Failed in parsing subtoken: SPELLCASTER of TestWP3,,TestWP4
      22:09:07.466 LSTERROR main AbstractTokenTestCase:224 Illegal ADD subtoken 'SPELLCASTER' 'TestWP3,,TestWP4' for TestObj
      22:09:07.466 LSTERROR main AbstractTokenTestCase:224 Non-sensical ADD:SPELLCASTER: Contains ANY and a specific reference: TestWP3,ANY
      22:09:07.467 LSTERROR main AbstractTokenTestCase:224 Failed in parsing subtoken: SPELLCASTER of TestWP3,ANY
      22:09:07.467 LSTERROR main AbstractTokenTestCase:224 Illegal ADD subtoken 'SPELLCASTER' 'TestWP3,ANY' for TestObj
      22:09:07.467 LSTERROR main AbstractTokenTestCase:224 Non-sensical ADD:SPELLCASTER: Contains ANY and a specific reference: ANY,TYPE=TestType
      22:09:07.467 LSTERROR main AbstractTokenTestCase:224 Failed in parsing subtoken: SPELLCASTER of ANY,TYPE=TestType
      22:09:07.468 LSTERROR main AbstractTokenTestCase:224 Illegal ADD subtoken 'SPELLCASTER' 'ANY,TYPE=TestType' for TestObj
      22:09:07.468 LSTERROR main AbstractTokenTestCase:224 Non-sensical ADD:SPELLCASTER: Contains ANY and a specific reference: TYPE=TestType,ANY
      22:09:07.468 LSTERROR main AbstractTokenTestCase:224 Failed in parsing subtoken: SPELLCASTER of TYPE=TestType,ANY
      22:09:07.468 LSTERROR main AbstractTokenTestCase:224 Illegal ADD subtoken 'SPELLCASTER' 'TYPE=TestType,ANY' for TestObj
      22:09:07.468 LSTERROR main AbstractTokenTestCase:224 Error was encountered while parsing ADD:SPELLCASTER: TYPE= is not a valid reference: TestWP3,TYPE=
      22:09:07.468 LSTERROR main AbstractTokenTestCase:224 Failed in parsing subtoken: SPELLCASTER of TestWP3,TYPE=
      22:09:07.468 LSTERROR main AbstractTokenTestCase:224 Illegal ADD subtoken 'SPELLCASTER' 'TestWP3,TYPE=' for TestObj
      22:09:07.469 LSTERROR main AbstractTokenTestCase:224 SPELLCASTER arguments uses double separator ,, : TestWP3,,TestWP4
      22:09:07.469 LSTERROR main AbstractTokenTestCase:224 Failed in parsing subtoken: SPELLCASTER of TestWP3,,TestWP4
      22:09:07.469 LSTERROR main AbstractTokenTestCase:224 Illegal ADD subtoken 'SPELLCASTER' 'TestWP3,,TestWP4' for TestObj
      22:09:07.469 LSTERROR main AbstractTokenTestCase:224 Non-sensical ADD:SPELLCASTER: Contains ANY and a specific reference: TestWP3,ANY
      22:09:07.469 LSTERROR main AbstractTokenTestCase:224 Failed in parsing subtoken: SPELLCASTER of TestWP3,ANY
      22:09:07.469 LSTERROR main AbstractTokenTestCase:224 Illegal ADD subtoken 'SPELLCASTER' 'TestWP3,ANY' for TestObj
      22:09:07.469 LSTERROR main AbstractTokenTestCase:224 ADD requires a SubToken and argument, found: SPELLCASTER
      22:09:07.471 LSTERROR main AbstractTokenTestCase:224 Non-sensical ADD:SPELLCASTER: Contains ANY and a specific reference: ANY,TYPE=TestType
      22:09:07.471 LSTERROR main AbstractTokenTestCase:224 Failed in parsing subtoken: SPELLCASTER of ANY,TYPE=TestType
      22:09:07.471 LSTERROR main AbstractTokenTestCase:224 Illegal ADD subtoken 'SPELLCASTER' 'ANY,TYPE=TestType' for TestObj
      22:09:07.472 LSTERROR main AbstractTokenTestCase:224 Non-sensical ADD:SPELLCASTER: Contains ANY and a specific reference: TYPE=TestType,ANY
      22:09:07.472 LSTERROR main AbstractTokenTestCase:224 Failed in parsing subtoken: SPELLCASTER of TYPE=TestType,ANY
      22:09:07.472 LSTERROR main AbstractTokenTestCase:224 Illegal ADD subtoken 'SPELLCASTER' 'TYPE=TestType,ANY' for TestObj
      22:09:07.472 LSTERROR main AbstractTokenTestCase:224 Error was encountered while parsing ADD:SPELLCASTER: TYPE= is not a valid reference: TestWP3,TYPE=
      22:09:07.472 LSTERROR main AbstractTokenTestCase:224 Failed in parsing subtoken: SPELLCASTER of TestWP3,TYPE=
      22:09:07.472 LSTERROR main AbstractTokenTestCase:224 Illegal ADD subtoken 'SPELLCASTER' 'TestWP3,TYPE=' for TestObj
      22:09:07.472 LSTERROR main AbstractTokenTestCase:224 SPELLCASTER arguments uses double separator ,, : TestWP3,,TestWP4
      22:09:07.473 LSTERROR main AbstractTokenTestCase:224 Failed in parsing subtoken: SPELLCASTER of TestWP3,,TestWP4
      22:09:07.473 LSTERROR main AbstractTokenTestCase:224 Illegal ADD subtoken 'SPELLCASTER' 'TestWP3,,TestWP4' for TestObj
      22:09:07.473 LSTERROR main AbstractTokenTestCase:224 Non-sensical ADD:SPELLCASTER: Contains ANY and a specific reference: TestWP3,ANY
      22:09:07.473 LSTERROR main AbstractTokenTestCase:224 Failed in parsing subtoken: SPELLCASTER of TestWP3,ANY
      22:09:07.473 LSTERROR main AbstractTokenTestCase:224 Illegal ADD subtoken 'SPELLCASTER' 'TestWP3,ANY' for TestObj
      22:09:07.473 LSTERROR main AbstractTokenTestCase:224 ADD requires a SubToken and argument, found: SPELLCASTER
      22:09:07.473 LSTERROR main AbstractTokenTestCase:224 SPELLCASTER may not have empty argument
      22:09:07.474 LSTERROR main AbstractTokenTestCase:224 Failed in parsing subtoken: SPELLCASTER of
      22:09:07.474 LSTERROR main AbstractTokenTestCase:224 Illegal ADD subtoken 'SPELLCASTER' '' for TestObj
      22:09:07.477 LSTERROR main AbstractTokenTestCase:224 Non-sensical ADD:SPELLCASTER: Contains ANY and a specific reference: ANY,TYPE=TestType
      22:09:07.477 LSTERROR main AbstractTokenTestCase:224 Failed in parsing subtoken: SPELLCASTER of ANY,TYPE=TestType
      22:09:07.477 LSTERROR main AbstractTokenTestCase:224 Illegal ADD subtoken 'SPELLCASTER' 'ANY,TYPE=TestType' for TestObj
      22:09:07.477 LSTERROR main AbstractTokenTestCase:224 Non-sensical ADD:SPELLCASTER: Contains ANY and a specific reference: TYPE=TestType,ANY
      22:09:07.477 LSTERROR main AbstractTokenTestCase:224 Failed in parsing subtoken: SPELLCASTER of TYPE=TestType,ANY
      22:09:07.477 LSTERROR main AbstractTokenTestCase:224 Illegal ADD subtoken 'SPELLCASTER' 'TYPE=TestType,ANY' for TestObj
      22:09:07.478 LSTERROR main AbstractTokenTestCase:224 Error was encountered while parsing ADD:SPELLCASTER: TYPE= is not a valid reference: TestWP3,TYPE=
      22:09:07.478 LSTERROR main AbstractTokenTestCase:224 Failed in parsing subtoken: SPELLCASTER of TestWP3,TYPE=
      22:09:07.478 LSTERROR main AbstractTokenTestCase:224 Illegal ADD subtoken 'SPELLCASTER' 'TestWP3,TYPE=' for TestObj
      22:09:07.478 LSTERROR main AbstractTokenTestCase:224 SPELLCASTER arguments uses double separator ,, : TestWP3,,TestWP4
      22:09:07.478 LSTERROR main AbstractTokenTestCase:224 Failed in parsing subtoken: SPELLCASTER of TestWP3,,TestWP4
      22:09:07.478 LSTERROR main AbstractTokenTestCase:224 Illegal ADD subtoken 'SPELLCASTER' 'TestWP3,,TestWP4' for TestObj
      22:09:07.478 LSTERROR main AbstractTokenTestCase:224 Non-sensical ADD:SPELLCASTER: Contains ANY and a specific reference: TestWP3,ANY
      22:09:07.479 LSTERROR main AbstractTokenTestCase:224 Failed in parsing subtoken: SPELLCASTER of TestWP3,ANY
      22:09:07.479 LSTERROR main AbstractTokenTestCase:224 Illegal ADD subtoken 'SPELLCASTER' 'TestWP3,ANY' for TestObj
      22:09:07.479 LSTERROR main AbstractTokenTestCase:224 ADD requires a SubToken and argument, found: SPELLCASTER
      22:09:07.479 LSTERROR main AbstractTokenTestCase:224 SPELLCASTER may not have empty argument
      22:09:07.479 LSTERROR main AbstractTokenTestCase:224 Failed in parsing subtoken: SPELLCASTER of
      22:09:07.479 LSTERROR main AbstractTokenTestCase:224 Illegal ADD subtoken 'SPELLCASTER' '' for TestObj
      22:09:07.479 LSTERROR main AbstractTokenTestCase:224 Count in ADD:SPELLCASTER must be > 0
      22:09:07.479 LSTERROR main AbstractTokenTestCase:224 Failed in parsing subtoken: SPELLCASTER of -1|TestWP1
      22:09:07.480 LSTERROR main AbstractTokenTestCase:224 Illegal ADD subtoken 'SPELLCASTER' '-1|TestWP1' for TestObj
      22:09:07.481 LSTERROR main AbstractTokenTestCase:224 Non-sensical ADD:SPELLCASTER: Contains ANY and a specific reference: ANY,TYPE=TestType
      22:09:07.481 LSTERROR main AbstractTokenTestCase:224 Failed in parsing subtoken: SPELLCASTER of ANY,TYPE=TestType
      22:09:07.482 LSTERROR main AbstractTokenTestCase:224 Illegal ADD subtoken 'SPELLCASTER' 'ANY,TYPE=TestType' for TestObj
      22:09:07.482 LSTERROR main AbstractTokenTestCase:224 Non-sensical ADD:SPELLCASTER: Contains ANY and a specific reference: TYPE=TestType,ANY
      22:09:07.482 LSTERROR main AbstractTokenTestCase:224 Failed in parsing subtoken: SPELLCASTER of TYPE=TestType,ANY
      22:09:07.482 LSTERROR main AbstractTokenTestCase:224 Illegal ADD subtoken 'SPELLCASTER' 'TYPE=TestType,ANY' for TestObj
      22:09:07.482 LSTERROR main AbstractTokenTestCase:224 Error was encountered while parsing ADD:SPELLCASTER: TYPE= is not a valid reference: TestWP3,TYPE=
      22:09:07.482 LSTERROR main AbstractTokenTestCase:224 Failed in parsing subtoken: SPELLCASTER of TestWP3,TYPE=
      22:09:07.482 LSTERROR main AbstractTokenTestCase:224 Illegal ADD subtoken 'SPELLCASTER' 'TestWP3,TYPE=' for TestObj
      22:09:07.483 LSTERROR main AbstractTokenTestCase:224 SPELLCASTER arguments uses double separator ,, : TestWP3,,TestWP4
      22:09:07.483 LSTERROR main AbstractTokenTestCase:224 Failed in parsing subtoken: SPELLCASTER of TestWP3,,TestWP4
      22:09:07.483 LSTERROR main AbstractTokenTestCase:224 Illegal ADD subtoken 'SPELLCASTER' 'TestWP3,,TestWP4' for TestObj
      22:09:07.483 LSTERROR main AbstractTokenTestCase:224 Non-sensical ADD:SPELLCASTER: Contains ANY and a specific reference: TestWP3,ANY
      22:09:07.483 LSTERROR main AbstractTokenTestCase:224 Failed in parsing subtoken: SPELLCASTER of TestWP3,ANY
      22:09:07.483 LSTERROR main AbstractTokenTestCase:224 Illegal ADD subtoken 'SPELLCASTER' 'TestWP3,ANY' for TestObj
      22:09:07.483 LSTERROR main AbstractTokenTestCase:224 ADD requires a SubToken and argument, found: SPELLCASTER
      22:09:07.483 LSTERROR main AbstractTokenTestCase:224 SPELLCASTER may not have empty argument
      22:09:07.484 LSTERROR main AbstractTokenTestCase:224 Failed in parsing subtoken: SPELLCASTER of
      22:09:07.484 LSTERROR main AbstractTokenTestCase:224 Illegal ADD subtoken 'SPELLCASTER' '' for TestObj
      22:09:07.484 LSTERROR main AbstractTokenTestCase:224 Count in ADD:SPELLCASTER must be > 0
      22:09:07.484 LSTERROR main AbstractTokenTestCase:224 Failed in parsing subtoken: SPELLCASTER of -1|TestWP1
      22:09:07.484 LSTERROR main AbstractTokenTestCase:224 Illegal ADD subtoken 'SPELLCASTER' '-1|TestWP1' for TestObj
      22:09:07.484 LSTERROR main AbstractTokenTestCase:224 Count in ADD:SPELLCASTER must be > 0
      22:09:07.484 LSTERROR main AbstractTokenTestCase:224 Failed in parsing subtoken: SPELLCASTER of 0|TestWP1
      22:09:07.484 LSTERROR main AbstractTokenTestCase:224 Illegal ADD subtoken 'SPELLCASTER' '0|TestWP1' for TestObj
      22:09:07.503 LSTERROR main AbstractTokenTestCase:224 Non-sensical ADD:SPELLCASTER: Contains ANY and a specific reference: ANY,TestWP1
      22:09:07.503 LSTERROR main AbstractTokenTestCase:224 Failed in parsing subtoken: SPELLCASTER of ANY,TestWP1
      22:09:07.503 LSTERROR main AbstractTokenTestCase:224 Illegal ADD subtoken 'SPELLCASTER' 'ANY,TestWP1' for TestObj
      22:09:07.505 LSTERROR main AbstractTokenTestCase:224 Non-sensical ADD:SPELLCASTER: Contains ANY and a specific reference: ANY,TestWP1
      22:09:07.505 LSTERROR main AbstractTokenTestCase:224 Failed in parsing subtoken: SPELLCASTER of ANY,TestWP1
      22:09:07.505 LSTERROR main AbstractTokenTestCase:224 Illegal ADD subtoken 'SPELLCASTER' 'ANY,TestWP1' for TestObj
      22:09:07.506 LSTERROR main AbstractTokenTestCase:224 Non-sensical ADD:SPELLCASTER: Contains ANY and a specific reference: TestWP1,ANY
      22:09:07.506 LSTERROR main AbstractTokenTestCase:224 Failed in parsing subtoken: SPELLCASTER of TestWP1,ANY
      22:09:07.506 LSTERROR main AbstractTokenTestCase:224 Illegal ADD subtoken 'SPELLCASTER' 'TestWP1,ANY' for TestObj
      Tests run: 61, Failures: 0, Errors: 0, Skipped: 0, Time elapsed: 0.298 sec
      Running plugin.lsttokens.editcontext.pcclass.KnownSpellsFromSpecialtyIntegrationTest
      22:09:07.513 SEVERE main TokenLibrary:148 Duplicate PCClass Token found for token KNOWNSPELLSFROMSPECIALTY
      Tests run: 14, Failures: 0, Errors: 0, Skipped: 0, Time elapsed: 0.017 sec
      Running plugin.lsttokens.equipmentmodifier.ArmortypeTokenTest
      22:09:07.528 SEVERE main TokenLibrary:148 Duplicate EquipmentModifier Token found for token ARMORTYPE
      22:09:07.529 LSTERROR main AbstractTokenTestCase:224 ARMORTYPE may not have empty argument
      22:09:07.532 LSTERROR main AbstractTokenTestCase:224 ARMORTYPE may not have empty argument
      22:09:07.533 LSTERROR main AbstractTokenTestCase:224 ARMORTYPE arguments uses double separator || : Light||Medium
      22:09:07.533 LSTERROR main AbstractTokenTestCase:224 ARMORTYPE may not have empty argument
      22:09:07.534 LSTERROR main AbstractTokenTestCase:224 ARMORTYPE arguments uses double separator || : Light||Medium
      22:09:07.534 LSTERROR main AbstractTokenTestCase:224 ARMORTYPE has no PIPE character: Must be of the form old|new
      22:09:07.535 LSTERROR main AbstractTokenTestCase:224 ARMORTYPE may not have empty argument
      22:09:07.535 LSTERROR main AbstractTokenTestCase:224 ARMORTYPE arguments uses double separator || : Light||Medium
      22:09:07.535 LSTERROR main AbstractTokenTestCase:224 ARMORTYPE has no PIPE character: Must be of the form old|new
      22:09:07.535 LSTERROR main AbstractTokenTestCase:224 ARMORTYPE arguments may not end with | : Medium|
      22:09:07.536 LSTERROR main AbstractTokenTestCase:224 ARMORTYPE may not have empty argument
      22:09:07.536 LSTERROR main AbstractTokenTestCase:224 ARMORTYPE arguments uses double separator || : Light||Medium
      22:09:07.536 LSTERROR main AbstractTokenTestCase:224 ARMORTYPE has no PIPE character: Must be of the form old|new
      22:09:07.536 LSTERROR main AbstractTokenTestCase:224 ARMORTYPE arguments may not end with | : Medium|
      22:09:07.536 LSTERROR main AbstractTokenTestCase:224 ARMORTYPE arguments may not start with | : |Medium
      22:09:07.537 LSTERROR main AbstractTokenTestCase:224 ARMORTYPE may not have empty argument
      22:09:07.537 LSTERROR main AbstractTokenTestCase:224 ARMORTYPE arguments uses double separator || : Light||Medium
      22:09:07.537 LSTERROR main AbstractTokenTestCase:224 ARMORTYPE has no PIPE character: Must be of the form old|new
      22:09:07.537 LSTERROR main AbstractTokenTestCase:224 ARMORTYPE arguments may not end with | : Medium|
      22:09:07.537 LSTERROR main AbstractTokenTestCase:224 ARMORTYPE arguments may not start with | : |Medium
      22:09:07.538 LSTERROR main AbstractTokenTestCase:224 ARMORTYPE has too many PIPE characters: Must be of the form old|new
      Tests run: 17, Failures: 0, Errors: 0, Skipped: 0, Time elapsed: 0.016 sec
      Running plugin.lsttokens.template.LevelAdjustmentTokenTest
      22:09:07.545 SEVERE main TokenLibrary:148 Duplicate PCTemplate Token found for token LEVELADJUSTMENT
      22:09:07.545 LSTERROR main AbstractTokenTestCase:224 ARMORTYPE may not have null argument
      22:09:07.546 LSTERROR main AbstractTokenTestCase:224 LEVELADJUSTMENT may not have empty argument
      Tests run: 10, Failures: 0, Errors: 0, Skipped: 0, Time elapsed: 0.01 sec
      Running pcgen.cdom.facet.DamageReductionFacetTest
      Tests run: 1, Failures: 0, Errors: 0, Skipped: 0, Time elapsed: 0.255 sec

      Results :

      Tests run: 14749, Failures: 0, Errors: 0, Skipped: 0

      Cobertura: Loaded information on 4070 classes.
      Cobertura: Saved information on 4070 classes.
      [HUDSON] Recording test results
      [INFO] [site:site {execution: default-site}]
      [INFO] artifact org.apache.maven.skins:maven-default-skin: checking for updates from ibiblio.repo
      [INFO] artifact org.apache.maven.skins:maven-default-skin: checking for updates from pcgen.repo
      [INFO] artifact org.apache.maven.skins:maven-default-skin: checking for updates from maven-plugins.repo
      [INFO] artifact org.apache.maven.skins:maven-default-skin: checking for updates from emma.repo
      [INFO] artifact org.apache.maven.skins:maven-default-skin: checking for updates from central
      [INFO] Skipped "Surefire Report" report, file "JUnit Test Results.html" already exists for the English version.
      [INFO] Skipped "About" report, file "index.html" already exists for the English version.
      [WARNING] [XHTML Sink] No HTML tag found for unknown event: 'action', ignoring!
      [WARNING] [XHTML Sink] No HTML tag found for unknown event: 'release', ignoring!
      [INFO] Generating "Surefire Report" report.
      [WARNING] Unable to locate Test Source XRef to link to - DISABLED
      [INFO] Generating "Cobertura Test Coverage" report.
      [INFO] Cobertura 1.9.2 - GNU GPL License (NO WARRANTY) - See COPYRIGHT file
      Cobertura: Loaded information on 4070 classes.
      Javancss.<init>(InputStream).e: net.sourceforge.cobertura.javancss.ParseException: Encountered ">" at line 34, column 72.
      Was expecting one of:
      "assert" ...
      "enum" ...
      <IDENTIFIER> ...
      "[" ...

      [cobertura] WARN [main] net.sourceforge.cobertura.reporting.ComplexityCalculator - JavaNCSS got an error while parsing the java file <http://ci.pcgen.org/hudson/job/PCGen%20Nightly%20Build%20(Trunk)/net.sourceforge.pcgen$pcgen/ws/code/src/java/pcgen/cdom/facet/AbstractDataFacet.java>
      ParseException in STDIN
      Last useful checkpoint: "pcgen.cdom.facet.AbstractDataFacet"
      Encountered ">" at line 34, column 72.
      Was expecting one of:
      "assert" ...
      "enum" ...
      <IDENTIFIER> ...
      "[" ...


      Report time: 37074ms

      [INFO] Cobertura Report generation was successful.
      [INFO] Generating "Change Log" report.
      [INFO] Generating changed sets xml to: <http://ci.pcgen.org/hudson/job/PCGen%20Nightly%20Build%20(Trunk)/net.sourceforge.pcgen$pcgen/ws/target/changelog.xml>
      [INFO] Executing: svn --non-interactive log -v -r "{2010-04-25 12:10:31 +0000}:{2010-07-25 12:10:31 +0000}" https://pcgen.svn.sourceforge.net/svnroot/pcgen/Trunk/pcgen
      [INFO] Working directory: <http://ci.pcgen.org/hudson/job/PCGen%20Nightly%20Build%20(Trunk)/net.sourceforge.pcgen$pcgen/ws/>
      [ERROR] Provider message:
      [ERROR] The svn command failed.
      [ERROR] Command output:
      [ERROR] svn: Can't open file '/root/.subversion/servers': Permission denied

      [HUDSON] Archiving site from <http://ci.pcgen.org/hudson/job/PCGen%20Nightly%20Build%20(Trunk)/net.sourceforge.pcgen$pcgen/ws/target/site> to /home/tomcat/.hudson/jobs/PCGen Nightly Build (Trunk)/site
      [INFO] ------------------------------------------------------------------------
      [ERROR] BUILD ERROR
      [INFO] ------------------------------------------------------------------------
    Your message has been successfully submitted and would be delivered to recipients shortly.