Loading ...
Sorry, an error occurred while loading the content.

LogitechMediaServer_v7.7.2 package request

Expand Messages
  • tals1975
    Hi ALL! Can someone would be so kind to prepare LogitechMediaServer_v7.7.2 for optware please? However, it is a big piece of job :)
    Message 1 of 1 , May 14, 2012
    • 0 Attachment
      Hi ALL!

      Can someone would be so kind to prepare LogitechMediaServer_v7.7.2 for optware please? However, it is a big piece of job :)

      http://downloads.slimdevices.com/LogitechMediaServer_v7.7.2/
      http://svn.slimdevices.com/repos/slim/7.7/trunk/vendor/CPAN/

      LogitechMediaServer_v7.7.2 supports more players and file formats in comparison with squeezecenter - 7.3.3 supported by optware.

      Thank you very much in advance.
      Sergey

      P.S. I've tried to compile all necessary packages for LogitechMediaServer_v7.7.2. Unfortunately, stuck with libmediascan-0.1:

      1] ./slimserver.pl --d_startup
      Can't locate loadable object for module Media::Scan in @INC


      2] (ffmpeg, libexif, libjpeg, libpng, giflib, libbdb are already in stage)


      libtool: compile: /tmp/optware/cs05q1armel/toolchain/arm-none-linux-gnueabi/gcc-2005q1-glibc-2.3.4/bin/arm-none-linux-gnueabi-gcc -DHAVE_CONFIG_H -I. -I.. -O2 -pipe -I/tmp/optware/cs05q1armel/staging/opt/include -Wall -I../include -I/tmp/optware/cs05q1armel/staging/opt/include -g -O2 -MT libmediascan_la-mediascan.lo -MD -MP -MF .deps/libmediascan_la-mediascan.Tpo -c mediascan.c -fPIC -DPIC -o .libs/libmediascan_la-mediascan.o
      mediascan.c: In function `register_codecs':
      mediascan.c:114: warning: implicit declaration of function `avcodec_register'
      mediascan.c: In function `register_formats':
      mediascan.c:202: warning: implicit declaration of function `av_register_protocol2'
      mediascan.c: In function `ms_set_log_level':
      mediascan.c:254: error: `AV_LOG_PANIC' undeclared (first use in this function)
      mediascan.c:254: error: (Each undeclared identifier is reported only once
      mediascan.c:254: error: for each function it appears in.)
      mediascan.c: In function `ms_add_path':
      mediascan.c:414: warning: implicit declaration of function `strlen'
      mediascan.c:421: warning: implicit declaration of function `strncpy'
      mediascan.c: In function `ms_set_cachedir':
      mediascan.c:554: warning: implicit declaration of function `strdup'
      mediascan.c: In function `_should_scan':
      mediascan.c:838: warning: implicit declaration of function `strrchr'
      mediascan.c:862: warning: implicit declaration of function `strstr'
      mediascan.c:865: warning: implicit declaration of function `strcmp'
      mediascan.c: In function `do_scan':
      mediascan.c:1030: warning: implicit declaration of function `strcpy'
      mediascan.c:1034: warning: implicit declaration of function `strcat'
      mediascan.c: In function `ms_scan_file':
      mediascan.c:1213: warning: implicit declaration of function `memset'
      make[3]: *** [libmediascan_la-mediascan.lo] Error 1
      make[3]: Leaving directory `/tmp/optware/cs05q1armel/builds/libmediascan/src'
      make[2]: *** [all-recursive] Error 1
      make[2]: Leaving directory `/tmp/optware/cs05q1armel/builds/libmediascan'
      make[1]: *** [all] Error 2
      make[1]: Leaving directory `/tmp/optware/cs05q1armel/builds/libmediascan'
      make: *** [/tmp/optware/cs05q1armel/builds/libmediascan/.built] Error 2
    Your message has been successfully submitted and would be delivered to recipients shortly.