Loading ...
Sorry, an error occurred while loading the content.

17913Re: [nslu2-linux] Openslug 3.10 comilation problems

Expand Messages
  • Viswanathan Sankararam
    Feb 28 6:29 PM
    • 0 Attachment
      I would really appreciate it if someone could respond
      to my problem Please :)

      -Vish
      --- Viswanathan Sankararam <nslu2vishu@...>
      wrote:

      > All,
      > I have downloaded the SlugOS 3.10 source files
      > and
      > tried to compile the sources. I created the
      > directory
      > downloads with the IPL_ixp400AccessLibrary_2.1.zip
      > and
      > IPL_ixp400NpeLibrary_2.1.zip and respective md5
      > files.
      > I then ran make openslug-distro. But I get the
      > following error
      >
      > NOTE: Unpacking
      >
      /home/vsankara/NSLU2_stuff/SlugOS_src/slugos-3.10-beta/openembedded/packages/meta/slugos-image.bb
      > to
      >
      /home/vsankara/NSLU2_stuff/SlugOS_src/slugos-3.10-beta/openslug-nslu2.tmp/work/slugos-image-1.0-r28/
      > NOTE: package slugos-image-1.0-r28: task do_unpack:
      > completed
      > NOTE: package slugos-image-1.0-r28: task do_patch:
      > started
      > NOTE: package slugos-image-1.0-r28: task do_patch:
      > completed
      > NOTE: package slugos-image-1.0-r28: task
      > do_configure:
      > started
      > NOTE: package slugos-image-1.0-r28: task
      > do_configure:
      > completed
      > NOTE: package slugos-image-1.0-r28: task do_compile:
      > started
      > NOTE: package slugos-image-1.0-r28: task do_compile:
      > completed
      > NOTE: package slugos-image-1.0-r28: task
      > do_populate_staging: started
      > NOTE: package slugos-image-1.0-r28: task
      > do_populate_staging: completed
      > NOTE: package slugos-image-1.0-r28: task do_install:
      > started
      > NOTE: package slugos-image-1.0-r28: task do_install:
      > completed
      > NOTE: package slugos-image-1.0-r28: task do_rootfs:
      > started
      > ERROR: function do_rootfs failed
      > ERROR: see log in
      >
      /home/vsankara/NSLU2_stuff/SlugOS_src/slugos-3.10-beta/openslug-nslu2.tmp/work/slugos-image-1.0-r28/temp/log.do_rootfs.2574
      > NOTE: Task failed:
      >
      /home/vsankara/NSLU2_stuff/SlugOS_src/slugos-3.10-beta/openslug-nslu2.tmp/work/slugos-image-1.0-r28/temp/log.do_rootfs.2574
      > NOTE: package slugos-image-1.0-r28: task do_rootfs:
      > failed
      > ERROR: TaskFailed event exception, aborting
      > NOTE: package slugos-image-1.0: failed
      > ERROR: Build of openslug-packages failed
      > make: *** [distro-unsafe] Error 1
      > make[2]: *** [distro-safe] Error 2
      > make[2]: Leaving directory
      >
      `/home/vsankara/NSLU2_stuff/SlugOS_src/slugos-3.10-beta'
      > make[1]: *** [configuration] Error 2
      > make[1]: Leaving directory
      >
      `/home/vsankara/NSLU2_stuff/SlugOS_src/slugos-3.10-beta'
      > make: *** [openslug-distro] Error 2
      >
      > The log file shows the following
      > + rm -rf
      >
      /home/vsankara/NSLU2_stuff/SlugOS_src/slugos-3.10-beta/openslug-nslu2.tmp/rootfs
      > + '[' 1 '!=' 1 ']'
      > + real_do_rootfs
      > + set -x
      > + mkdir -p
      >
      /home/vsankara/NSLU2_stuff/SlugOS_src/slugos-3.10-beta/openslug-nslu2.tmp/rootfs/dev
      > + '[' -z '' ']'
      > + rm -f
      >
      /home/vsankara/NSLU2_stuff/SlugOS_src/slugos-3.10-beta/openslug-nslu2.tmp/deploy/ipk/Packages
      > + touch
      >
      /home/vsankara/NSLU2_stuff/SlugOS_src/slugos-3.10-beta/openslug-nslu2.tmp/deploy/ipk/Packages
      > + ipkg-make-index -r
      >
      /home/vsankara/NSLU2_stuff/SlugOS_src/slugos-3.10-beta/openslug-nslu2.tmp/deploy/ipk/Packages
      > -p
      >
      /home/vsankara/NSLU2_stuff/SlugOS_src/slugos-3.10-beta/openslug-nslu2.tmp/deploy/ipk/Packages
      > -l
      >
      /home/vsankara/NSLU2_stuff/SlugOS_src/slugos-3.10-beta/openslug-nslu2.tmp/deploy/ipk/Packages.filelist
      > -m
      >
      /home/vsankara/NSLU2_stuff/SlugOS_src/slugos-3.10-beta/openslug-nslu2.tmp/deploy/ipk
      > tar: Pattern matching characters used in file names.
      > Please,
      > tar: use --wildcards to enable pattern matching, or
      > --no-wildcards to
      > tar: suppress this warning.
      > tar: *control: Not found in archive
      > tar: Error exit delayed from previous errors
      > tar: Pattern matching characters used in file names.
      > Please,
      > tar: use --wildcards to enable pattern matching, or
      > --no-wildcards to
      > tar: suppress this warning.
      > tar: *control: Not found in archive
      >
      > And the above seems to be repeating.
      >
      > Any body any ideas how I can get past this? I really
      > appreciate any help. This procedure used to work
      > before. I wanted to create a new build but I dont
      > know
      > why its not working now.
      >
      > Thanks
      > Vish
      >
      >
      >
      >
      >
      >
      ____________________________________________________________________________________
      > Want to start your own business?
      > Learn how on Yahoo! Small Business.
      > http://smallbusiness.yahoo.com/r-index
      >




      ____________________________________________________________________________________
      Need a quick answer? Get one in minutes from people who know.
      Ask your question on www.Answers.yahoo.com
    • Show all 2 messages in this topic