Loading ...
Sorry, an error occurred while loading the content.

tomcat deps on ant which deps on junit ... BUILD FAILED

Expand Messages
  • tekmonk2005
    ~ While trying to install tomcat-7.0.27 it tells me install ant, wich tells me to install junit and then you get: ~ BUILD FAILED
    Message 1 of 6 , Apr 30 1:31 PM
    View Source
    • 0 Attachment
      ~
      While trying to install tomcat-7.0.27 it tells me install ant, wich tells me to install junit and then you get:
      ~
      BUILD FAILED
      /media/sdb1/prjx/sw/jwebXBL/java_baseline/srcs/junit/junit/build.xml:191: The following error occurred while executing this line:
      /media/sdb1/prjx/sw/jwebXBL/java_baseline/srcs/junit/junit/build.xml:179: Java returned: 1
      at org.apache.tools.ant.taskdefs.Java.execute(Java.java:111)
      ...
      at org.apache.tools.ant.launch.Launcher.main(Launcher.java:109)
      ~
      Has anyone dealt with those issues?
      ~
      lbrtchx
      ~
      $ git clone https://github.com/KentBeck/junit.git > "/media/sdb1/prjx/sw/jwebXBL/java_baseline/srcs/junit/REF/junit.git_"$_DT".inst_build.log" 2>&1
      $ cd junit
      $ ant -verbose dist

      BUILD FAILED
      /media/sdb1/prjx/sw/jwebXBL/java_baseline/srcs/junit/junit/build.xml:191: The following error occurred while executing this line:
      /media/sdb1/prjx/sw/jwebXBL/java_baseline/srcs/junit/junit/build.xml:179: Java returned: 1
      at org.apache.tools.ant.taskdefs.Java.execute(Java.java:111)
      at org.apache.tools.ant.UnknownElement.execute(UnknownElement.java:291)
      at sun.reflect.GeneratedMethodAccessor4.invoke(Unknown Source)
      at sun.reflect.DelegatingMethodAccessorImpl.invoke(DelegatingMethodAccessorImpl.java:43)
      at java.lang.reflect.Method.invoke(Method.java:601)
      at org.apache.tools.ant.dispatch.DispatchUtils.execute(DispatchUtils.java:106)
      at org.apache.tools.ant.Task.perform(Task.java:348)
      at org.apache.tools.ant.taskdefs.Sequential.execute(Sequential.java:68)
      at org.apache.tools.ant.UnknownElement.execute(UnknownElement.java:291)
      at sun.reflect.GeneratedMethodAccessor4.invoke(Unknown Source)
      at sun.reflect.DelegatingMethodAccessorImpl.invoke(DelegatingMethodAccessorImpl.java:43)
      at java.lang.reflect.Method.invoke(Method.java:601)
      at org.apache.tools.ant.dispatch.DispatchUtils.execute(DispatchUtils.java:106)
      at org.apache.tools.ant.Task.perform(Task.java:348)
      at org.apache.tools.ant.taskdefs.MacroInstance.execute(MacroInstance.java:398)
      at org.apache.tools.ant.UnknownElement.execute(UnknownElement.java:291)
      at sun.reflect.GeneratedMethodAccessor4.invoke(Unknown Source)
      at sun.reflect.DelegatingMethodAccessorImpl.invoke(DelegatingMethodAccessorImpl.java:43)
      at java.lang.reflect.Method.invoke(Method.java:601)
      at org.apache.tools.ant.dispatch.DispatchUtils.execute(DispatchUtils.java:106)
      at org.apache.tools.ant.Task.perform(Task.java:348)
      at org.apache.tools.ant.Target.execute(Target.java:390)
      at org.apache.tools.ant.Target.performTasks(Target.java:411)
      at org.apache.tools.ant.Project.executeSortedTargets(Project.java:1399)
      at org.apache.tools.ant.Project.executeTarget(Project.java:1368)
      at org.apache.tools.ant.helper.DefaultExecutor.executeTargets(DefaultExecutor.java:41)
      at org.apache.tools.ant.Project.executeTargets(Project.java:1251)
      at org.apache.tools.ant.Main.runBuild(Main.java:809)
      at org.apache.tools.ant.Main.startAnt(Main.java:217)
      at org.apache.tools.ant.launch.Launcher.run(Launcher.java:280)
      at org.apache.tools.ant.launch.Launcher.main(Launcher.java:109)

      Total time: 25 seconds
    • tekmonk2005
      Actually the complete failure trace is: dist: [java] Executing /media/sdb1/prjx/sw/jwebXBL/java_baseline/srcs/jdk/jdk1.7.0_04/jre/bin/java with arguments:
      Message 2 of 6 , Apr 30 5:54 PM
      View Source
      • 0 Attachment
        Actually the complete failure trace is:

        dist:
        [java] Executing '/media/sdb1/prjx/sw/jwebXBL/java_baseline/srcs/jdk/jdk1.7.0_04/jre/bin/java' with arguments:
        [java] '-Dignore.this=ignored'
        [java] '-classpath'
        [java] '/media/sdb1/prjx/sw/jwebXBL/java_baseline/srcs/junit/junit/junit4.11-SNAPSHOT:/media/sdb1/prjx/sw/jwebXBL/java_baseline/srcs/junit/junit/junit4.11-SNAPSHOT/junit-4.11-SNAPSHOT.jar'
        [java] 'org.junit.runner.JUnitCore'
        [java] 'org.junit.tests.AllTests'
        [java]
        [java] The ' characters around the executable and arguments are
        [java] not part of the command.
        Execute:Java13CommandLauncher: Executing '/media/sdb1/prjx/sw/jwebXBL/java_baseline/srcs/jdk/jdk1.7.0_04/jre/bin/java' with arguments:
        '-Dignore.this=ignored'
        '-classpath'
        '/media/sdb1/prjx/sw/jwebXBL/java_baseline/srcs/junit/junit/junit4.11-SNAPSHOT:/media/sdb1/prjx/sw/jwebXBL/java_baseline/srcs/junit/junit/junit4.11-SNAPSHOT/junit-4.11-SNAPSHOT.jar'
        'org.junit.runner.JUnitCore'
        'org.junit.tests.AllTests'

        The ' characters around the executable and arguments are
        not part of the command.
        [java] JUnit version 4.11-SNAPSHOT
        [java] .................................................................................................................................................................................................................................................................................................................I.I...........................................................................................................................................................................................I.....................................................................................................E....
        [java] Time: 5.69
        [java] There was 1 failure:
        [java] 1) testNameAsc(org.junit.internal.MethodSorterTest)
        [java] org.junit.ComparisonFailure: expected:<...(), void epsilon(), [int gamma(), void gamma(boolean])]> but was:<...(), void epsilon(), [void gamma(boolean), int gamma(])]>
        [java] at org.junit.Assert.assertEquals(Assert.java:125)
        [java] at org.junit.Assert.assertEquals(Assert.java:147)
        [java] at org.junit.internal.MethodSorterTest.testNameAsc(MethodSorterTest.java:93)
        [java] at sun.reflect.NativeMethodAccessorImpl.invoke0(Native Method)
        [java] at sun.reflect.NativeMethodAccessorImpl.invoke(NativeMethodAccessorImpl.java:57)
        [java] at sun.reflect.DelegatingMethodAccessorImpl.invoke(DelegatingMethodAccessorImpl.java:43)
        [java] at java.lang.reflect.Method.invoke(Method.java:601)
        [java] at org.junit.runners.model.FrameworkMethod$1.runReflectiveCall(FrameworkMethod.java:45)
        [java] at org.junit.internal.runners.model.ReflectiveCallable.run(ReflectiveCallable.java:15)
        [java] at org.junit.runners.model.FrameworkMethod.invokeExplosively(FrameworkMethod.java:42)
        [java] at org.junit.internal.runners.statements.InvokeMethod.evaluate(InvokeMethod.java:20)
        [java] at org.junit.runners.ParentRunner.runLeaf(ParentRunner.java:269)
        [java] at org.junit.runners.BlockJUnit4ClassRunner.runChild(BlockJUnit4ClassRunner.java:69)
        [java] at org.junit.runners.BlockJUnit4ClassRunner.runChild(BlockJUnit4ClassRunner.java:48)
        [java] at org.junit.runners.ParentRunner$3.run(ParentRunner.java:237)
        [java] at org.junit.runners.ParentRunner$1.schedule(ParentRunner.java:61)
        [java] at org.junit.runners.ParentRunner.runChildren(ParentRunner.java:235)
        [java] at org.junit.runners.ParentRunner.access$000(ParentRunner.java:51)
        [java] at org.junit.runners.ParentRunner$2.evaluate(ParentRunner.java:228)
        [java] at org.junit.runners.ParentRunner.run(ParentRunner.java:306)
        [java] at org.junit.runners.Suite.runChild(Suite.java:128)
        [java] at org.junit.runners.Suite.runChild(Suite.java:24)
        [java] at org.junit.runners.ParentRunner$3.run(ParentRunner.java:237)
        [java] at org.junit.runners.ParentRunner$1.schedule(ParentRunner.java:61)
        [java] at org.junit.runners.ParentRunner.runChildren(ParentRunner.java:235)
        [java] at org.junit.runners.ParentRunner.access$000(ParentRunner.java:51)
        [java] at org.junit.runners.ParentRunner$2.evaluate(ParentRunner.java:228)
        [java] at org.junit.runners.ParentRunner.run(ParentRunner.java:306)
        [java] at org.junit.runners.Suite.runChild(Suite.java:128)
        [java] at org.junit.runners.Suite.runChild(Suite.java:24)
        [java] at org.junit.runners.ParentRunner$3.run(ParentRunner.java:237)
        [java] at org.junit.runners.ParentRunner$1.schedule(ParentRunner.java:61)
        [java] at org.junit.runners.ParentRunner.runChildren(ParentRunner.java:235)
        [java] at org.junit.runners.ParentRunner.access$000(ParentRunner.java:51)
        [java] at org.junit.runners.ParentRunner$2.evaluate(ParentRunner.java:228)
        [java] at org.junit.runners.ParentRunner.run(ParentRunner.java:306)
        [java] at org.junit.runner.JUnitCore.run(JUnitCore.java:151)
        [java] at org.junit.runner.JUnitCore.run(JUnitCore.java:130)
        [java] at org.junit.runner.JUnitCore.run(JUnitCore.java:111)
        [java] at org.junit.runner.JUnitCore.runMain(JUnitCore.java:92)
        [java] at org.junit.runner.JUnitCore.runMainAndExit(JUnitCore.java:47)
        [java] at org.junit.runner.JUnitCore.main(JUnitCore.java:38)
        [java]
        [java] FAILURES!!!
        [java] Tests run: 598, Failures: 1
        [java]

        BUILD FAILED
        /media/sdb1/prjx/sw/jwebXBL/java_baseline/srcs/junit/junit/build.xml:191: The following error occurred while executing this line:
        /media/sdb1/prjx/sw/jwebXBL/java_baseline/srcs/junit/junit/build.xml:179: Java returned: 1
        at org.apache.tools.ant.taskdefs.Java.execute(Java.java:111)
        at org.apache.tools.ant.UnknownElement.execute(UnknownElement.java:291)
        at sun.reflect.GeneratedMethodAccessor4.invoke(Unknown Source)
        at sun.reflect.DelegatingMethodAccessorImpl.invoke(DelegatingMethodAccessorImpl.java:43)
        at java.lang.reflect.Method.invoke(Method.java:601)
        at org.apache.tools.ant.dispatch.DispatchUtils.execute(DispatchUtils.java:106)
        at org.apache.tools.ant.Task.perform(Task.java:348)
        at org.apache.tools.ant.taskdefs.Sequential.execute(Sequential.java:68)
        at org.apache.tools.ant.UnknownElement.execute(UnknownElement.java:291)
        at sun.reflect.GeneratedMethodAccessor4.invoke(Unknown Source)
        at sun.reflect.DelegatingMethodAccessorImpl.invoke(DelegatingMethodAccessorImpl.java:43)
        at java.lang.reflect.Method.invoke(Method.java:601)
        at org.apache.tools.ant.dispatch.DispatchUtils.execute(DispatchUtils.java:106)
        at org.apache.tools.ant.Task.perform(Task.java:348)
        at org.apache.tools.ant.taskdefs.MacroInstance.execute(MacroInstance.java:398)
        at org.apache.tools.ant.UnknownElement.execute(UnknownElement.java:291)
        at sun.reflect.GeneratedMethodAccessor4.invoke(Unknown Source)
        at sun.reflect.DelegatingMethodAccessorImpl.invoke(DelegatingMethodAccessorImpl.java:43)
        at java.lang.reflect.Method.invoke(Method.java:601)
        at org.apache.tools.ant.dispatch.DispatchUtils.execute(DispatchUtils.java:106)
        at org.apache.tools.ant.Task.perform(Task.java:348)
        at org.apache.tools.ant.Target.execute(Target.java:390)
        at org.apache.tools.ant.Target.performTasks(Target.java:411)
        at org.apache.tools.ant.Project.executeSortedTargets(Project.java:1399)
        at org.apache.tools.ant.Project.executeTarget(Project.java:1368)
        at org.apache.tools.ant.helper.DefaultExecutor.executeTargets(DefaultExecutor.java:41)
        at org.apache.tools.ant.Project.executeTargets(Project.java:1251)
        at org.apache.tools.ant.Main.runBuild(Main.java:809)
        at org.apache.tools.ant.Main.startAnt(Main.java:217)
        at org.apache.tools.ant.launch.Launcher.run(Launcher.java:280)
        at org.apache.tools.ant.launch.Launcher.main(Launcher.java:109)

        Total time: 25 seconds
      • tekmonk2005
        and this error is reported as a fixed bug ~ https://issues.apache.org/bugzilla/show_bug.cgi?id=45028 ~ lbrtchx
        Message 3 of 6 , Apr 30 6:42 PM
        View Source
        • 0 Attachment
          and this error is reported as a fixed bug
          ~
          https://issues.apache.org/bugzilla/show_bug.cgi?id=45028
          ~
          lbrtchx
        • tekmonk2005
          ~ I really don t know how to make sense of this, but ant does not appear to like symbolic links ... ~ lbrtchx ~ $ ls -l /usr/bin/ant lrwxrwxrwx 1 root root 20
          Message 4 of 6 , Apr 30 6:54 PM
          View Source
          • 0 Attachment
            ~
            I really don't know how to make sense of this, but ant does not appear to like symbolic links ...
            ~
            lbrtchx
            ~
            $ ls -l /usr/bin/ant
            lrwxrwxrwx 1 root root 20 Sep 13 2011 /usr/bin/ant -> ../share/ant/bin/ant

            $ ls -lH /usr/bin/ant
            -rwxr-xr-x 1 root root 9903 May 19 2011 /usr/bin/ant

            $ ls -l /usr/share/ant/bin/ant
            -rwxr-xr-x 1 root root 9903 May 19 2011 /usr/share/ant/bin/ant

            $ ANT_HOME=/usr/share/ant
            $ export PATH=$ANT_HOME/bin:$PATH

            $ ant -verbose -debug -Dtests.haltonfailure=false dist
            Apache Ant(TM) version 1.8.3 compiled on April 30 2012
            Trying the default build file: build.xml
            Buildfile: /media/sdb1/prjx/sw/jwebXBL/java_baseline/srcs/junit/junit/build.xml
            ...
            [java] JUnit version 4.11-SNAPSHOT
            [java] .................................................................................................................................................................................................................................................................................................................I.I...........................................................................................................................................................................................I.........................................................................................................
            [java] Time: 5.796
            [java]
            [java] OK (598 tests)
            [java]

            BUILD SUCCESSFUL
            Total time: 24 seconds
          • Marc Philipp
            In line 179 of build.xml a java task is executed in order to run the AllTests suite. I m not too familiar with Ant but this does not look like a JUnit issue.
            Message 5 of 6 , Apr 30 10:47 PM
            View Source
            • 0 Attachment
              In line 179 of build.xml a java task is executed in order to run the AllTests suite. I'm not too familiar with Ant but this does not look like a JUnit issue.

              Regards, Marc


              Am 30.04.2012 um 22:31 schrieb tekmonk2005:

              > ~
              > While trying to install tomcat-7.0.27 it tells me install ant, wich tells me to install junit and then you get:
              > ~
              > BUILD FAILED
              > /media/sdb1/prjx/sw/jwebXBL/java_baseline/srcs/junit/junit/build.xml:191: The following error occurred while executing this line:
              > /media/sdb1/prjx/sw/jwebXBL/java_baseline/srcs/junit/junit/build.xml:179: Java returned: 1
              > at org.apache.tools.ant.taskdefs.Java.execute(Java.java:111)
              > ...
              > at org.apache.tools.ant.launch.Launcher.main(Launcher.java:109)
              > ~
              > Has anyone dealt with those issues?
              > ~
              > lbrtchx
              > ~
              > $ git clone https://github.com/KentBeck/junit.git > "/media/sdb1/prjx/sw/jwebXBL/java_baseline/srcs/junit/REF/junit.git_"$_DT".inst_build.log" 2>&1
              > $ cd junit
              > $ ant -verbose dist
              >
              > BUILD FAILED
              > /media/sdb1/prjx/sw/jwebXBL/java_baseline/srcs/junit/junit/build.xml:191: The following error occurred while executing this line:
              > /media/sdb1/prjx/sw/jwebXBL/java_baseline/srcs/junit/junit/build.xml:179: Java returned: 1
              > at org.apache.tools.ant.taskdefs.Java.execute(Java.java:111)
              > at org.apache.tools.ant.UnknownElement.execute(UnknownElement.java:291)
              > at sun.reflect.GeneratedMethodAccessor4.invoke(Unknown Source)
              > at sun.reflect.DelegatingMethodAccessorImpl.invoke(DelegatingMethodAccessorImpl.java:43)
              > at java.lang.reflect.Method.invoke(Method.java:601)
              > at org.apache.tools.ant.dispatch.DispatchUtils.execute(DispatchUtils.java:106)
              > at org.apache.tools.ant.Task.perform(Task.java:348)
              > at org.apache.tools.ant.taskdefs.Sequential.execute(Sequential.java:68)
              > at org.apache.tools.ant.UnknownElement.execute(UnknownElement.java:291)
              > at sun.reflect.GeneratedMethodAccessor4.invoke(Unknown Source)
              > at sun.reflect.DelegatingMethodAccessorImpl.invoke(DelegatingMethodAccessorImpl.java:43)
              > at java.lang.reflect.Method.invoke(Method.java:601)
              > at org.apache.tools.ant.dispatch.DispatchUtils.execute(DispatchUtils.java:106)
              > at org.apache.tools.ant.Task.perform(Task.java:348)
              > at org.apache.tools.ant.taskdefs.MacroInstance.execute(MacroInstance.java:398)
              > at org.apache.tools.ant.UnknownElement.execute(UnknownElement.java:291)
              > at sun.reflect.GeneratedMethodAccessor4.invoke(Unknown Source)
              > at sun.reflect.DelegatingMethodAccessorImpl.invoke(DelegatingMethodAccessorImpl.java:43)
              > at java.lang.reflect.Method.invoke(Method.java:601)
              > at org.apache.tools.ant.dispatch.DispatchUtils.execute(DispatchUtils.java:106)
              > at org.apache.tools.ant.Task.perform(Task.java:348)
              > at org.apache.tools.ant.Target.execute(Target.java:390)
              > at org.apache.tools.ant.Target.performTasks(Target.java:411)
              > at org.apache.tools.ant.Project.executeSortedTargets(Project.java:1399)
              > at org.apache.tools.ant.Project.executeTarget(Project.java:1368)
              > at org.apache.tools.ant.helper.DefaultExecutor.executeTargets(DefaultExecutor.java:41)
              > at org.apache.tools.ant.Project.executeTargets(Project.java:1251)
              > at org.apache.tools.ant.Main.runBuild(Main.java:809)
              > at org.apache.tools.ant.Main.startAnt(Main.java:217)
              > at org.apache.tools.ant.launch.Launcher.run(Launcher.java:280)
              > at org.apache.tools.ant.launch.Launcher.main(Launcher.java:109)
              >
              > Total time: 25 seconds
              >
              >
            • David Saff
              Sorry for the long delay in responding. Matthew, This looks potentially related to your method-sorting patch? (
              Message 6 of 6 , May 9, 2012
              View Source
              • 0 Attachment
                Sorry for the long delay in responding.

                Matthew,

                This looks potentially related to your method-sorting patch? (
                https://github.com/KentBeck/junit/commit/c610a49727858597d9a10289bed0a0174053a69f
                )

                Can you give any advice? Thanks,

                David Saff

                On Mon, Apr 30, 2012 at 8:54 PM, tekmonk2005 <tekmonk2005@...> wrote:

                > **
                >
                >
                > Actually the complete failure trace is:
                >
                > dist:
                > [java] Executing
                > '/media/sdb1/prjx/sw/jwebXBL/java_baseline/srcs/jdk/jdk1.7.0_04/jre/bin/java'
                > with arguments:
                > [java] '-Dignore.this=ignored'
                > [java] '-classpath'
                > [java]
                > '/media/sdb1/prjx/sw/jwebXBL/java_baseline/srcs/junit/junit/junit4.11-SNAPSHOT:/media/sdb1/prjx/sw/jwebXBL/java_baseline/srcs/junit/junit/junit4.11-SNAPSHOT/junit-4.11-SNAPSHOT.jar'
                > [java] 'org.junit.runner.JUnitCore'
                > [java] 'org.junit.tests.AllTests'
                > [java]
                > [java] The ' characters around the executable and arguments are
                > [java] not part of the command.
                > Execute:Java13CommandLauncher: Executing
                > '/media/sdb1/prjx/sw/jwebXBL/java_baseline/srcs/jdk/jdk1.7.0_04/jre/bin/java'
                > with arguments:
                > '-Dignore.this=ignored'
                > '-classpath'
                >
                > '/media/sdb1/prjx/sw/jwebXBL/java_baseline/srcs/junit/junit/junit4.11-SNAPSHOT:/media/sdb1/prjx/sw/jwebXBL/java_baseline/srcs/junit/junit/junit4.11-SNAPSHOT/junit-4.11-SNAPSHOT.jar'
                > 'org.junit.runner.JUnitCore'
                > 'org.junit.tests.AllTests'
                >
                > The ' characters around the executable and arguments are
                > not part of the command.
                > [java] JUnit version 4.11-SNAPSHOT
                > [java]
                > .................................................................................................................................................................................................................................................................................................................I.I...........................................................................................................................................................................................I.....................................................................................................E....
                > [java] Time: 5.69
                > [java] There was 1 failure:
                > [java] 1) testNameAsc(org.junit.internal.MethodSorterTest)
                > [java] org.junit.ComparisonFailure: expected:<...(), void epsilon(), [int
                > gamma(), void gamma(boolean])]> but was:<...(), void epsilon(), [void
                > gamma(boolean), int gamma(])]>
                > [java] at org.junit.Assert.assertEquals(Assert.java:125)
                > [java] at org.junit.Assert.assertEquals(Assert.java:147)
                > [java] at
                > org.junit.internal.MethodSorterTest.testNameAsc(MethodSorterTest.java:93)
                > [java] at sun.reflect.NativeMethodAccessorImpl.invoke0(Native Method)
                > [java] at
                > sun.reflect.NativeMethodAccessorImpl.invoke(NativeMethodAccessorImpl.java:57)
                > [java] at
                > sun.reflect.DelegatingMethodAccessorImpl.invoke(DelegatingMethodAccessorImpl.java:43)
                > [java] at java.lang.reflect.Method.invoke(Method.java:601)
                > [java] at
                > org.junit.runners.model.FrameworkMethod$1.runReflectiveCall(FrameworkMethod.java:45)
                > [java] at
                > org.junit.internal.runners.model.ReflectiveCallable.run(ReflectiveCallable.java:15)
                > [java] at
                > org.junit.runners.model.FrameworkMethod.invokeExplosively(FrameworkMethod.java:42)
                > [java] at
                > org.junit.internal.runners.statements.InvokeMethod.evaluate(InvokeMethod.java:20)
                > [java] at org.junit.runners.ParentRunner.runLeaf(ParentRunner.java:269)
                > [java] at
                > org.junit.runners.BlockJUnit4ClassRunner.runChild(BlockJUnit4ClassRunner.java:69)
                > [java] at
                > org.junit.runners.BlockJUnit4ClassRunner.runChild(BlockJUnit4ClassRunner.java:48)
                > [java] at org.junit.runners.ParentRunner$3.run(ParentRunner.java:237)
                > [java] at org.junit.runners.ParentRunner$1.schedule(ParentRunner.java:61)
                > [java] at org.junit.runners.ParentRunner.runChildren(ParentRunner.java:235)
                > [java] at org.junit.runners.ParentRunner.access$000(ParentRunner.java:51)
                > [java] at org.junit.runners.ParentRunner$2.evaluate(ParentRunner.java:228)
                > [java] at org.junit.runners.ParentRunner.run(ParentRunner.java:306)
                > [java] at org.junit.runners.Suite.runChild(Suite.java:128)
                > [java] at org.junit.runners.Suite.runChild(Suite.java:24)
                > [java] at org.junit.runners.ParentRunner$3.run(ParentRunner.java:237)
                > [java] at org.junit.runners.ParentRunner$1.schedule(ParentRunner.java:61)
                > [java] at org.junit.runners.ParentRunner.runChildren(ParentRunner.java:235)
                > [java] at org.junit.runners.ParentRunner.access$000(ParentRunner.java:51)
                > [java] at org.junit.runners.ParentRunner$2.evaluate(ParentRunner.java:228)
                > [java] at org.junit.runners.ParentRunner.run(ParentRunner.java:306)
                > [java] at org.junit.runners.Suite.runChild(Suite.java:128)
                > [java] at org.junit.runners.Suite.runChild(Suite.java:24)
                > [java] at org.junit.runners.ParentRunner$3.run(ParentRunner.java:237)
                > [java] at org.junit.runners.ParentRunner$1.schedule(ParentRunner.java:61)
                > [java] at org.junit.runners.ParentRunner.runChildren(ParentRunner.java:235)
                > [java] at org.junit.runners.ParentRunner.access$000(ParentRunner.java:51)
                > [java] at org.junit.runners.ParentRunner$2.evaluate(ParentRunner.java:228)
                > [java] at org.junit.runners.ParentRunner.run(ParentRunner.java:306)
                > [java] at org.junit.runner.JUnitCore.run(JUnitCore.java:151)
                > [java] at org.junit.runner.JUnitCore.run(JUnitCore.java:130)
                > [java] at org.junit.runner.JUnitCore.run(JUnitCore.java:111)
                > [java] at org.junit.runner.JUnitCore.runMain(JUnitCore.java:92)
                > [java] at org.junit.runner.JUnitCore.runMainAndExit(JUnitCore.java:47)
                > [java] at org.junit.runner.JUnitCore.main(JUnitCore.java:38)
                > [java]
                > [java] FAILURES!!!
                > [java] Tests run: 598, Failures: 1
                > [java]
                >
                > BUILD FAILED
                > /media/sdb1/prjx/sw/jwebXBL/java_baseline/srcs/junit/junit/build.xml:191:
                > The following error occurred while executing this line:
                > /media/sdb1/prjx/sw/jwebXBL/java_baseline/srcs/junit/junit/build.xml:179:
                > Java returned: 1
                > at org.apache.tools.ant.taskdefs.Java.execute(Java.java:111)
                > at org.apache.tools.ant.UnknownElement.execute(UnknownElement.java:291)
                > at sun.reflect.GeneratedMethodAccessor4.invoke(Unknown Source)
                > at
                > sun.reflect.DelegatingMethodAccessorImpl.invoke(DelegatingMethodAccessorImpl.java:43)
                > at java.lang.reflect.Method.invoke(Method.java:601)
                > at
                > org.apache.tools.ant.dispatch.DispatchUtils.execute(DispatchUtils.java:106)
                > at org.apache.tools.ant.Task.perform(Task.java:348)
                > at org.apache.tools.ant.taskdefs.Sequential.execute(Sequential.java:68)
                > at org.apache.tools.ant.UnknownElement.execute(UnknownElement.java:291)
                > at sun.reflect.GeneratedMethodAccessor4.invoke(Unknown Source)
                > at
                > sun.reflect.DelegatingMethodAccessorImpl.invoke(DelegatingMethodAccessorImpl.java:43)
                > at java.lang.reflect.Method.invoke(Method.java:601)
                > at
                > org.apache.tools.ant.dispatch.DispatchUtils.execute(DispatchUtils.java:106)
                > at org.apache.tools.ant.Task.perform(Task.java:348)
                > at
                > org.apache.tools.ant.taskdefs.MacroInstance.execute(MacroInstance.java:398)
                > at org.apache.tools.ant.UnknownElement.execute(UnknownElement.java:291)
                > at sun.reflect.GeneratedMethodAccessor4.invoke(Unknown Source)
                > at
                > sun.reflect.DelegatingMethodAccessorImpl.invoke(DelegatingMethodAccessorImpl.java:43)
                > at java.lang.reflect.Method.invoke(Method.java:601)
                > at
                > org.apache.tools.ant.dispatch.DispatchUtils.execute(DispatchUtils.java:106)
                > at org.apache.tools.ant.Task.perform(Task.java:348)
                > at org.apache.tools.ant.Target.execute(Target.java:390)
                > at org.apache.tools.ant.Target.performTasks(Target.java:411)
                > at org.apache.tools.ant.Project.executeSortedTargets(Project.java:1399)
                > at org.apache.tools.ant.Project.executeTarget(Project.java:1368)
                > at
                > org.apache.tools.ant.helper.DefaultExecutor.executeTargets(DefaultExecutor.java:41)
                > at org.apache.tools.ant.Project.executeTargets(Project.java:1251)
                > at org.apache.tools.ant.Main.runBuild(Main.java:809)
                > at org.apache.tools.ant.Main.startAnt(Main.java:217)
                > at org.apache.tools.ant.launch.Launcher.run(Launcher.java:280)
                > at org.apache.tools.ant.launch.Launcher.main(Launcher.java:109)
                >
                > Total time: 25 seconds
                >
                >
                >


                [Non-text portions of this message have been removed]
              Your message has been successfully submitted and would be delivered to recipients shortly.