Loading ...
Sorry, an error occurred while loading the content.

[Cheetahtemplate-discuss] Cheetah-Test failure - 51 failures

Expand Messages
  • tOM Trottier
    I am new to Python and Cheetah and having problems getting going. Am using Pythonxy Eclipse framework. But when I run Cheetah test I get these errors:
    Message 1 of 2 , May 23, 2010
    • 0 Attachment
      I am new to Python and Cheetah and having problems getting going.
      Am using Pythonxy Eclipse framework.

      But when I run Cheetah test I get these errors:



      ..............FFFFFFFFF......................................................................................................FFFFFF...............FFFFWarning: unable to delete
      tch directory %s
      FFWarning: unable to delete scratch directory %s
      ................................................................................................................................................................................
      ................................................................................................................................................................................
      ................................................................................................................................................................................
      ........................................................................FFF.........
      **********************************************************************
      FAIL Cheetah.Tests.CheetahWrapper.Flat.testCompile ()
      ----------------------------------------------------------------------
      Traceback (most recent call last):
      File "C:\Python26\lib\site-packages\Cheetah\Tests\CheetahWrapper.py", line 434, in testCompile
      self.go("cheetah compile --flat child/a.tmpl")
      File "C:\Python26\lib\site-packages\Cheetah\Tests\CheetahWrapper.py", line 192, in go
      self.failUnlessEqual(signal, 0, msg)
      File "C:\Python26\lib\site-packages\Cheetah\Tests\unittest_local_copy.py", line 413, in failUnlessEqual
      raise self.failureException, (msg or '%s != %s' % (first, second))
      AssertionError: subcommand killed by signal 1: cheetah compile --flat child/a.tmpl

      **********************************************************************
      FAIL Cheetah.Tests.CheetahWrapper.Flat.testFill ()
      ----------------------------------------------------------------------
      Traceback (most recent call last):
      File "C:\Python26\lib\site-packages\Cheetah\Tests\CheetahWrapper.py", line 438, in testFill
      self.go("cheetah fill --flat child/a.tmpl")
      File "C:\Python26\lib\site-packages\Cheetah\Tests\CheetahWrapper.py", line 192, in go
      self.failUnlessEqual(signal, 0, msg)
      File "C:\Python26\lib\site-packages\Cheetah\Tests\unittest_local_copy.py", line 413, in failUnlessEqual
      raise self.failureException, (msg or '%s != %s' % (first, second))
      AssertionError: subcommand killed by signal 1: cheetah fill --flat child/a.tmpl

      **********************************************************************
      FAIL Cheetah.Tests.CheetahWrapper.Flat.testText ()
      ----------------------------------------------------------------------
      Traceback (most recent call last):
      File "C:\Python26\lib\site-packages\Cheetah\Tests\CheetahWrapper.py", line 442, in testText
      self.go("cheetah fill --flat --oext txt child/a.tmpl")
      File "C:\Python26\lib\site-packages\Cheetah\Tests\CheetahWrapper.py", line 192, in go
      self.failUnlessEqual(signal, 0, msg)
      File "C:\Python26\lib\site-packages\Cheetah\Tests\unittest_local_copy.py", line 413, in failUnlessEqual
      raise self.failureException, (msg or '%s != %s' % (first, second))
      AssertionError: subcommand killed by signal 1: cheetah fill --flat --oext txt child/a.tmpl

      **********************************************************************
      FAIL Cheetah.Tests.CheetahWrapper.FlatRecurseCollision.testCompile ()
      ----------------------------------------------------------------------
      Traceback (most recent call last):
      File "C:\Python26\lib\site-packages\Cheetah\Tests\CheetahWrapper.py", line 450, in testCompile
      self.goExpectError("cheetah compile -R --flat")
      File "C:\Python26\lib\site-packages\Cheetah\Tests\CheetahWrapper.py", line 214, in goExpectError
      self.failUnlessEqual(signal, 0, msg) # Signal must be 0.
      File "C:\Python26\lib\site-packages\Cheetah\Tests\unittest_local_copy.py", line 413, in failUnlessEqual
      raise self.failureException, (msg or '%s != %s' % (first, second))
      AssertionError: subcommand killed by signal 1: cheetah compile -R --flat

      **********************************************************************
      FAIL Cheetah.Tests.CheetahWrapper.FlatRecurseCollision.testFill ()
      ----------------------------------------------------------------------
      Traceback (most recent call last):
      File "C:\Python26\lib\site-packages\Cheetah\Tests\CheetahWrapper.py", line 453, in testFill
      self.goExpectError("cheetah fill -R --flat")
      File "C:\Python26\lib\site-packages\Cheetah\Tests\CheetahWrapper.py", line 214, in goExpectError
      self.failUnlessEqual(signal, 0, msg) # Signal must be 0.
      File "C:\Python26\lib\site-packages\Cheetah\Tests\unittest_local_copy.py", line 413, in failUnlessEqual
      raise self.failureException, (msg or '%s != %s' % (first, second))
      AssertionError: subcommand killed by signal 1: cheetah fill -R --flat

      **********************************************************************
      FAIL Cheetah.Tests.CheetahWrapper.FlatRecurseCollision.testText ()
      ----------------------------------------------------------------------
      Traceback (most recent call last):
      File "C:\Python26\lib\site-packages\Cheetah\Tests\CheetahWrapper.py", line 456, in testText
      self.goExpectError("cheetah fill -R --flat")
      File "C:\Python26\lib\site-packages\Cheetah\Tests\CheetahWrapper.py", line 214, in goExpectError
      self.failUnlessEqual(signal, 0, msg) # Signal must be 0.
      File "C:\Python26\lib\site-packages\Cheetah\Tests\unittest_local_copy.py", line 413, in failUnlessEqual
      raise self.failureException, (msg or '%s != %s' % (first, second))
      AssertionError: subcommand killed by signal 1: cheetah fill -R --flat

      **********************************************************************
      FAIL Cheetah.Tests.CheetahWrapper.IdirFlatRecurseCollision.testCompile ()
      ----------------------------------------------------------------------
      Traceback (most recent call last):
      File "C:\Python26\lib\site-packages\Cheetah\Tests\CheetahWrapper.py", line 501, in testCompile
      self.goExpectError("cheetah compile -R --flat --idir SRC")
      File "C:\Python26\lib\site-packages\Cheetah\Tests\CheetahWrapper.py", line 214, in goExpectError
      self.failUnlessEqual(signal, 0, msg) # Signal must be 0.
      File "C:\Python26\lib\site-packages\Cheetah\Tests\unittest_local_copy.py", line 413, in failUnlessEqual
      raise self.failureException, (msg or '%s != %s' % (first, second))
      AssertionError: subcommand killed by signal 1: cheetah compile -R --flat --idir SRC

      **********************************************************************
      FAIL Cheetah.Tests.CheetahWrapper.IdirFlatRecurseCollision.testFill ()
      ----------------------------------------------------------------------
      Traceback (most recent call last):
      File "C:\Python26\lib\site-packages\Cheetah\Tests\CheetahWrapper.py", line 504, in testFill
      self.goExpectError("cheetah fill -R --flat --idir SRC")
      File "C:\Python26\lib\site-packages\Cheetah\Tests\CheetahWrapper.py", line 214, in goExpectError
      self.failUnlessEqual(signal, 0, msg) # Signal must be 0.
      File "C:\Python26\lib\site-packages\Cheetah\Tests\unittest_local_copy.py", line 413, in failUnlessEqual
      raise self.failureException, (msg or '%s != %s' % (first, second))
      AssertionError: subcommand killed by signal 1: cheetah fill -R --flat --idir SRC

      **********************************************************************
      FAIL Cheetah.Tests.CheetahWrapper.IdirFlatRecurseCollision.testText ()
      ----------------------------------------------------------------------
      Traceback (most recent call last):
      File "C:\Python26\lib\site-packages\Cheetah\Tests\CheetahWrapper.py", line 507, in testText
      self.goExpectError("cheetah fill -R --flat --idir SRC --oext txt")
      File "C:\Python26\lib\site-packages\Cheetah\Tests\CheetahWrapper.py", line 214, in goExpectError
      self.failUnlessEqual(signal, 0, msg) # Signal must be 0.
      File "C:\Python26\lib\site-packages\Cheetah\Tests\unittest_local_copy.py", line 413, in failUnlessEqual
      raise self.failureException, (msg or '%s != %s' % (first, second))
      AssertionError: subcommand killed by signal 1: cheetah fill -R --flat --idir SRC --oext txt

      **********************************************************************
      FAIL Cheetah.Tests.CheetahWrapper.IdirOdirRecurse.testCompile ()
      ----------------------------------------------------------------------
      Traceback (most recent call last):
      File "C:\Python26\lib\site-packages\Cheetah\Tests\CheetahWrapper.py", line 480, in testCompile
      self.go("cheetah compile -R --idir SRC --odir DEST child")
      File "C:\Python26\lib\site-packages\Cheetah\Tests\CheetahWrapper.py", line 192, in go
      self.failUnlessEqual(signal, 0, msg)
      File "C:\Python26\lib\site-packages\Cheetah\Tests\unittest_local_copy.py", line 413, in failUnlessEqual
      raise self.failureException, (msg or '%s != %s' % (first, second))
      AssertionError: subcommand killed by signal 1: cheetah compile -R --idir SRC --odir DEST child

      **********************************************************************
      FAIL Cheetah.Tests.CheetahWrapper.IdirOdirRecurse.testFill ()
      ----------------------------------------------------------------------
      Traceback (most recent call last):
      File "C:\Python26\lib\site-packages\Cheetah\Tests\CheetahWrapper.py", line 487, in testFill
      self.go("cheetah fill -R --idir SRC --odir DEST child")
      File "C:\Python26\lib\site-packages\Cheetah\Tests\CheetahWrapper.py", line 192, in go
      self.failUnlessEqual(signal, 0, msg)
      File "C:\Python26\lib\site-packages\Cheetah\Tests\unittest_local_copy.py", line 413, in failUnlessEqual
      raise self.failureException, (msg or '%s != %s' % (first, second))
      AssertionError: subcommand killed by signal 1: cheetah fill -R --idir SRC --odir DEST child

      **********************************************************************
      FAIL Cheetah.Tests.CheetahWrapper.IdirOdirRecurse.testText ()
      ----------------------------------------------------------------------
      Traceback (most recent call last):
      File "C:\Python26\lib\site-packages\Cheetah\Tests\CheetahWrapper.py", line 492, in testText
      self.go("cheetah fill -R --idir SRC --odir DEST --oext txt child")
      File "C:\Python26\lib\site-packages\Cheetah\Tests\CheetahWrapper.py", line 192, in go
      self.failUnlessEqual(signal, 0, msg)
      File "C:\Python26\lib\site-packages\Cheetah\Tests\unittest_local_copy.py", line 413, in failUnlessEqual
      raise self.failureException, (msg or '%s != %s' % (first, second))
      AssertionError: subcommand killed by signal 1: cheetah fill -R --idir SRC --odir DEST --oext txt child

      **********************************************************************
      FAIL Cheetah.Tests.CheetahWrapper.IdirRecurse.testCompile ()
      ----------------------------------------------------------------------
      Traceback (most recent call last):
      File "C:\Python26\lib\site-packages\Cheetah\Tests\CheetahWrapper.py", line 461, in testCompile
      self.go("cheetah compile -R --idir SRC child")
      File "C:\Python26\lib\site-packages\Cheetah\Tests\CheetahWrapper.py", line 192, in go
      self.failUnlessEqual(signal, 0, msg)
      File "C:\Python26\lib\site-packages\Cheetah\Tests\unittest_local_copy.py", line 413, in failUnlessEqual
      raise self.failureException, (msg or '%s != %s' % (first, second))
      AssertionError: subcommand killed by signal 1: cheetah compile -R --idir SRC child

      **********************************************************************
      FAIL Cheetah.Tests.CheetahWrapper.IdirRecurse.testFill ()
      ----------------------------------------------------------------------
      Traceback (most recent call last):
      File "C:\Python26\lib\site-packages\Cheetah\Tests\CheetahWrapper.py", line 468, in testFill
      self.go("cheetah fill -R --idir SRC child")
      File "C:\Python26\lib\site-packages\Cheetah\Tests\CheetahWrapper.py", line 192, in go
      self.failUnlessEqual(signal, 0, msg)
      File "C:\Python26\lib\site-packages\Cheetah\Tests\unittest_local_copy.py", line 413, in failUnlessEqual
      raise self.failureException, (msg or '%s != %s' % (first, second))
      AssertionError: subcommand killed by signal 1: cheetah fill -R --idir SRC child

      **********************************************************************
      FAIL Cheetah.Tests.CheetahWrapper.IdirRecurse.testText ()
      ----------------------------------------------------------------------
      Traceback (most recent call last):
      File "C:\Python26\lib\site-packages\Cheetah\Tests\CheetahWrapper.py", line 473, in testText
      self.go("cheetah fill -R --idir SRC --oext txt child")
      File "C:\Python26\lib\site-packages\Cheetah\Tests\CheetahWrapper.py", line 192, in go
      self.failUnlessEqual(signal, 0, msg)
      File "C:\Python26\lib\site-packages\Cheetah\Tests\unittest_local_copy.py", line 413, in failUnlessEqual
      raise self.failureException, (msg or '%s != %s' % (first, second))
      AssertionError: subcommand killed by signal 1: cheetah fill -R --idir SRC --oext txt child

      **********************************************************************
      FAIL Cheetah.Tests.CheetahWrapper.NoBackup.testCompile (Run the command twice each time and verify a backup file is, )
      ----------------------------------------------------------------------
      Traceback (most recent call last):
      File "C:\Python26\lib\site-packages\Cheetah\Tests\CheetahWrapper.py", line 515, in testCompile
      self.go("cheetah compile --nobackup a.tmpl")
      File "C:\Python26\lib\site-packages\Cheetah\Tests\CheetahWrapper.py", line 192, in go
      self.failUnlessEqual(signal, 0, msg)
      File "C:\Python26\lib\site-packages\Cheetah\Tests\unittest_local_copy.py", line 413, in failUnlessEqual
      raise self.failureException, (msg or '%s != %s' % (first, second))
      AssertionError: subcommand killed by signal 1: cheetah compile --nobackup a.tmpl

      **********************************************************************
      FAIL Cheetah.Tests.CheetahWrapper.NoBackup.testFill (Run the command twice each time and verify a backup file is, )
      ----------------------------------------------------------------------
      Traceback (most recent call last):
      File "C:\Python26\lib\site-packages\Cheetah\Tests\CheetahWrapper.py", line 520, in testFill
      self.go("cheetah fill --nobackup a.tmpl")
      File "C:\Python26\lib\site-packages\Cheetah\Tests\CheetahWrapper.py", line 192, in go
      self.failUnlessEqual(signal, 0, msg)
      File "C:\Python26\lib\site-packages\Cheetah\Tests\unittest_local_copy.py", line 413, in failUnlessEqual
      raise self.failureException, (msg or '%s != %s' % (first, second))
      AssertionError: subcommand killed by signal 1: cheetah fill --nobackup a.tmpl

      **********************************************************************
      FAIL Cheetah.Tests.CheetahWrapper.NoBackup.testText (Run the command twice each time and verify a backup file is, )
      ----------------------------------------------------------------------
      Traceback (most recent call last):
      File "C:\Python26\lib\site-packages\Cheetah\Tests\CheetahWrapper.py", line 525, in testText
      self.go("cheetah fill --nobackup --oext txt a.tmpl")
      File "C:\Python26\lib\site-packages\Cheetah\Tests\CheetahWrapper.py", line 192, in go
      self.failUnlessEqual(signal, 0, msg)
      File "C:\Python26\lib\site-packages\Cheetah\Tests\unittest_local_copy.py", line 413, in failUnlessEqual
      raise self.failureException, (msg or '%s != %s' % (first, second))
      AssertionError: subcommand killed by signal 1: cheetah fill --nobackup --oext txt a.tmpl

      **********************************************************************
      FAIL Cheetah.Tests.CheetahWrapper.OneFile.testCompile ()
      ----------------------------------------------------------------------
      Traceback (most recent call last):
      File "C:\Python26\lib\site-packages\Cheetah\Tests\CheetahWrapper.py", line 240, in testCompile
      self.go("cheetah compile a.tmpl")
      File "C:\Python26\lib\site-packages\Cheetah\Tests\CheetahWrapper.py", line 192, in go
      self.failUnlessEqual(signal, 0, msg)
      File "C:\Python26\lib\site-packages\Cheetah\Tests\unittest_local_copy.py", line 413, in failUnlessEqual
      raise self.failureException, (msg or '%s != %s' % (first, second))
      AssertionError: subcommand killed by signal 1: cheetah compile a.tmpl

      **********************************************************************
      FAIL Cheetah.Tests.CheetahWrapper.OneFile.testFill ()
      ----------------------------------------------------------------------
      Traceback (most recent call last):
      File "C:\Python26\lib\site-packages\Cheetah\Tests\CheetahWrapper.py", line 244, in testFill
      self.go("cheetah fill a.tmpl")
      File "C:\Python26\lib\site-packages\Cheetah\Tests\CheetahWrapper.py", line 192, in go
      self.failUnlessEqual(signal, 0, msg)
      File "C:\Python26\lib\site-packages\Cheetah\Tests\unittest_local_copy.py", line 413, in failUnlessEqual
      raise self.failureException, (msg or '%s != %s' % (first, second))
      AssertionError: subcommand killed by signal 1: cheetah fill a.tmpl

      **********************************************************************
      FAIL Cheetah.Tests.CheetahWrapper.OneFile.testText ()
      ----------------------------------------------------------------------
      Traceback (most recent call last):
      File "C:\Python26\lib\site-packages\Cheetah\Tests\CheetahWrapper.py", line 248, in testText
      self.go("cheetah fill --oext txt a.tmpl")
      File "C:\Python26\lib\site-packages\Cheetah\Tests\CheetahWrapper.py", line 192, in go
      self.failUnlessEqual(signal, 0, msg)
      File "C:\Python26\lib\site-packages\Cheetah\Tests\unittest_local_copy.py", line 413, in failUnlessEqual
      raise self.failureException, (msg or '%s != %s' % (first, second))
      AssertionError: subcommand killed by signal 1: cheetah fill --oext txt a.tmpl

      **********************************************************************
      FAIL Cheetah.Tests.CheetahWrapper.OneFileNoExtension.testCompile ()
      ----------------------------------------------------------------------
      Traceback (most recent call last):
      File "C:\Python26\lib\site-packages\Cheetah\Tests\CheetahWrapper.py", line 254, in testCompile
      self.go("cheetah compile a")
      File "C:\Python26\lib\site-packages\Cheetah\Tests\CheetahWrapper.py", line 192, in go
      self.failUnlessEqual(signal, 0, msg)
      File "C:\Python26\lib\site-packages\Cheetah\Tests\unittest_local_copy.py", line 413, in failUnlessEqual
      raise self.failureException, (msg or '%s != %s' % (first, second))
      AssertionError: subcommand killed by signal 1: cheetah compile a

      **********************************************************************
      FAIL Cheetah.Tests.CheetahWrapper.OneFileNoExtension.testFill ()
      ----------------------------------------------------------------------
      Traceback (most recent call last):
      File "C:\Python26\lib\site-packages\Cheetah\Tests\CheetahWrapper.py", line 258, in testFill
      self.go("cheetah fill a")
      File "C:\Python26\lib\site-packages\Cheetah\Tests\CheetahWrapper.py", line 192, in go
      self.failUnlessEqual(signal, 0, msg)
      File "C:\Python26\lib\site-packages\Cheetah\Tests\unittest_local_copy.py", line 413, in failUnlessEqual
      raise self.failureException, (msg or '%s != %s' % (first, second))
      AssertionError: subcommand killed by signal 1: cheetah fill a

      **********************************************************************
      FAIL Cheetah.Tests.CheetahWrapper.OneFileNoExtension.testText ()
      ----------------------------------------------------------------------
      Traceback (most recent call last):
      File "C:\Python26\lib\site-packages\Cheetah\Tests\CheetahWrapper.py", line 262, in testText
      self.go("cheetah fill --oext txt a")
      File "C:\Python26\lib\site-packages\Cheetah\Tests\CheetahWrapper.py", line 192, in go
      self.failUnlessEqual(signal, 0, msg)
      File "C:\Python26\lib\site-packages\Cheetah\Tests\unittest_local_copy.py", line 413, in failUnlessEqual
      raise self.failureException, (msg or '%s != %s' % (first, second))
      AssertionError: subcommand killed by signal 1: cheetah fill --oext txt a

      **********************************************************************
      FAIL Cheetah.Tests.CheetahWrapper.OneFileWithOdir.testCompile ()
      ----------------------------------------------------------------------
      Traceback (most recent call last):
      File "C:\Python26\lib\site-packages\Cheetah\Tests\CheetahWrapper.py", line 341, in testCompile
      self.go("cheetah compile --odir DEST a.tmpl")
      File "C:\Python26\lib\site-packages\Cheetah\Tests\CheetahWrapper.py", line 192, in go
      self.failUnlessEqual(signal, 0, msg)
      File "C:\Python26\lib\site-packages\Cheetah\Tests\unittest_local_copy.py", line 413, in failUnlessEqual
      raise self.failureException, (msg or '%s != %s' % (first, second))
      AssertionError: subcommand killed by signal 1: cheetah compile --odir DEST a.tmpl

      **********************************************************************
      FAIL Cheetah.Tests.CheetahWrapper.OneFileWithOdir.testFill ()
      ----------------------------------------------------------------------
      Traceback (most recent call last):
      File "C:\Python26\lib\site-packages\Cheetah\Tests\CheetahWrapper.py", line 346, in testFill
      self.go("cheetah fill --odir DEST a.tmpl")
      File "C:\Python26\lib\site-packages\Cheetah\Tests\CheetahWrapper.py", line 192, in go
      self.failUnlessEqual(signal, 0, msg)
      File "C:\Python26\lib\site-packages\Cheetah\Tests\unittest_local_copy.py", line 413, in failUnlessEqual
      raise self.failureException, (msg or '%s != %s' % (first, second))
      AssertionError: subcommand killed by signal 1: cheetah fill --odir DEST a.tmpl

      **********************************************************************
      FAIL Cheetah.Tests.CheetahWrapper.OneFileWithOdir.testText ()
      ----------------------------------------------------------------------
      Traceback (most recent call last):
      File "C:\Python26\lib\site-packages\Cheetah\Tests\CheetahWrapper.py", line 350, in testText
      self.go("cheetah fill --odir DEST --oext txt a.tmpl")
      File "C:\Python26\lib\site-packages\Cheetah\Tests\CheetahWrapper.py", line 192, in go
      self.failUnlessEqual(signal, 0, msg)
      File "C:\Python26\lib\site-packages\Cheetah\Tests\unittest_local_copy.py", line 413, in failUnlessEqual
      raise self.failureException, (msg or '%s != %s' % (first, second))
      AssertionError: subcommand killed by signal 1: cheetah fill --odir DEST --oext txt a.tmpl

      **********************************************************************
      FAIL Cheetah.Tests.CheetahWrapper.RecurseExplicit.testCompile ()
      ----------------------------------------------------------------------
      Traceback (most recent call last):
      File "C:\Python26\lib\site-packages\Cheetah\Tests\CheetahWrapper.py", line 379, in testCompile
      self.go("cheetah compile -R child")
      File "C:\Python26\lib\site-packages\Cheetah\Tests\CheetahWrapper.py", line 192, in go
      self.failUnlessEqual(signal, 0, msg)
      File "C:\Python26\lib\site-packages\Cheetah\Tests\unittest_local_copy.py", line 413, in failUnlessEqual
      raise self.failureException, (msg or '%s != %s' % (first, second))
      AssertionError: subcommand killed by signal 1: cheetah compile -R child

      **********************************************************************
      FAIL Cheetah.Tests.CheetahWrapper.RecurseExplicit.testFill ()
      ----------------------------------------------------------------------
      Traceback (most recent call last):
      File "C:\Python26\lib\site-packages\Cheetah\Tests\CheetahWrapper.py", line 384, in testFill
      self.go("cheetah fill -R child")
      File "C:\Python26\lib\site-packages\Cheetah\Tests\CheetahWrapper.py", line 192, in go
      self.failUnlessEqual(signal, 0, msg)
      File "C:\Python26\lib\site-packages\Cheetah\Tests\unittest_local_copy.py", line 413, in failUnlessEqual
      raise self.failureException, (msg or '%s != %s' % (first, second))
      AssertionError: subcommand killed by signal 1: cheetah fill -R child

      **********************************************************************
      FAIL Cheetah.Tests.CheetahWrapper.RecurseExplicit.testText ()
      ----------------------------------------------------------------------
      Traceback (most recent call last):
      File "C:\Python26\lib\site-packages\Cheetah\Tests\CheetahWrapper.py", line 389, in testText
      self.go("cheetah fill -R --oext txt child")
      File "C:\Python26\lib\site-packages\Cheetah\Tests\CheetahWrapper.py", line 192, in go
      self.failUnlessEqual(signal, 0, msg)
      File "C:\Python26\lib\site-packages\Cheetah\Tests\unittest_local_copy.py", line 413, in failUnlessEqual
      raise self.failureException, (msg or '%s != %s' % (first, second))
      AssertionError: subcommand killed by signal 1: cheetah fill -R --oext txt child

      **********************************************************************
      FAIL Cheetah.Tests.CheetahWrapper.RecurseExplicitWIthOdir.testCompile ()
      ----------------------------------------------------------------------
      Traceback (most recent call last):
      File "C:\Python26\lib\site-packages\Cheetah\Tests\CheetahWrapper.py", line 415, in testCompile
      self.go("cheetah compile -R --odir DEST child")
      File "C:\Python26\lib\site-packages\Cheetah\Tests\CheetahWrapper.py", line 192, in go
      self.failUnlessEqual(signal, 0, msg)
      File "C:\Python26\lib\site-packages\Cheetah\Tests\unittest_local_copy.py", line 413, in failUnlessEqual
      raise self.failureException, (msg or '%s != %s' % (first, second))
      AssertionError: subcommand killed by signal 1: cheetah compile -R --odir DEST child

      **********************************************************************
      FAIL Cheetah.Tests.CheetahWrapper.RecurseExplicitWIthOdir.testFill ()
      ----------------------------------------------------------------------
      Traceback (most recent call last):
      File "C:\Python26\lib\site-packages\Cheetah\Tests\CheetahWrapper.py", line 422, in testFill
      self.go("cheetah fill -R --odir DEST child")
      File "C:\Python26\lib\site-packages\Cheetah\Tests\CheetahWrapper.py", line 192, in go
      self.failUnlessEqual(signal, 0, msg)
      File "C:\Python26\lib\site-packages\Cheetah\Tests\unittest_local_copy.py", line 413, in failUnlessEqual
      raise self.failureException, (msg or '%s != %s' % (first, second))
      AssertionError: subcommand killed by signal 1: cheetah fill -R --odir DEST child

      **********************************************************************
      FAIL Cheetah.Tests.CheetahWrapper.RecurseExplicitWIthOdir.testText ()
      ----------------------------------------------------------------------
      Traceback (most recent call last):
      File "C:\Python26\lib\site-packages\Cheetah\Tests\CheetahWrapper.py", line 427, in testText
      self.go("cheetah fill -R --odir DEST --oext txt child")
      File "C:\Python26\lib\site-packages\Cheetah\Tests\CheetahWrapper.py", line 192, in go
      self.failUnlessEqual(signal, 0, msg)
      File "C:\Python26\lib\site-packages\Cheetah\Tests\unittest_local_copy.py", line 413, in failUnlessEqual
      raise self.failureException, (msg or '%s != %s' % (first, second))
      AssertionError: subcommand killed by signal 1: cheetah fill -R --odir DEST --oext txt child

      **********************************************************************
      FAIL Cheetah.Tests.CheetahWrapper.RecurseImplicit.testCompile ()
      ----------------------------------------------------------------------
      Traceback (most recent call last):
      File "C:\Python26\lib\site-packages\Cheetah\Tests\CheetahWrapper.py", line 396, in testCompile
      self.go("cheetah compile -R")
      File "C:\Python26\lib\site-packages\Cheetah\Tests\CheetahWrapper.py", line 192, in go
      self.failUnlessEqual(signal, 0, msg)
      File "C:\Python26\lib\site-packages\Cheetah\Tests\unittest_local_copy.py", line 413, in failUnlessEqual
      raise self.failureException, (msg or '%s != %s' % (first, second))
      AssertionError: subcommand killed by signal 1: cheetah compile -R

      **********************************************************************
      FAIL Cheetah.Tests.CheetahWrapper.RecurseImplicit.testFill ()
      ----------------------------------------------------------------------
      Traceback (most recent call last):
      File "C:\Python26\lib\site-packages\Cheetah\Tests\CheetahWrapper.py", line 401, in testFill
      self.go("cheetah fill -R")
      File "C:\Python26\lib\site-packages\Cheetah\Tests\CheetahWrapper.py", line 192, in go
      self.failUnlessEqual(signal, 0, msg)
      File "C:\Python26\lib\site-packages\Cheetah\Tests\unittest_local_copy.py", line 413, in failUnlessEqual
      raise self.failureException, (msg or '%s != %s' % (first, second))
      AssertionError: subcommand killed by signal 1: cheetah fill -R

      **********************************************************************
      FAIL Cheetah.Tests.CheetahWrapper.RecurseImplicit.testText ()
      ----------------------------------------------------------------------
      Traceback (most recent call last):
      File "C:\Python26\lib\site-packages\Cheetah\Tests\CheetahWrapper.py", line 407, in testText
      self.go("cheetah fill -R --oext txt")
      File "C:\Python26\lib\site-packages\Cheetah\Tests\CheetahWrapper.py", line 192, in go
      self.failUnlessEqual(signal, 0, msg)
      File "C:\Python26\lib\site-packages\Cheetah\Tests\unittest_local_copy.py", line 413, in failUnlessEqual
      raise self.failureException, (msg or '%s != %s' % (first, second))
      AssertionError: subcommand killed by signal 1: cheetah fill -R --oext txt

      **********************************************************************
      FAIL Cheetah.Tests.CheetahWrapper.SplatTmpl.testCompile ()
      ----------------------------------------------------------------------
      Traceback (most recent call last):
      File "C:\Python26\lib\site-packages\Cheetah\Tests\CheetahWrapper.py", line 268, in testCompile
      self.go("cheetah compile *.tmpl")
      File "C:\Python26\lib\site-packages\Cheetah\Tests\CheetahWrapper.py", line 192, in go
      self.failUnlessEqual(signal, 0, msg)
      File "C:\Python26\lib\site-packages\Cheetah\Tests\unittest_local_copy.py", line 413, in failUnlessEqual
      raise self.failureException, (msg or '%s != %s' % (first, second))
      AssertionError: subcommand killed by signal 1: cheetah compile *.tmpl

      **********************************************************************
      FAIL Cheetah.Tests.CheetahWrapper.SplatTmpl.testFill ()
      ----------------------------------------------------------------------
      Traceback (most recent call last):
      File "C:\Python26\lib\site-packages\Cheetah\Tests\CheetahWrapper.py", line 272, in testFill
      self.go("cheetah fill *.tmpl")
      File "C:\Python26\lib\site-packages\Cheetah\Tests\CheetahWrapper.py", line 192, in go
      self.failUnlessEqual(signal, 0, msg)
      File "C:\Python26\lib\site-packages\Cheetah\Tests\unittest_local_copy.py", line 413, in failUnlessEqual
      raise self.failureException, (msg or '%s != %s' % (first, second))
      AssertionError: subcommand killed by signal 1: cheetah fill *.tmpl

      **********************************************************************
      FAIL Cheetah.Tests.CheetahWrapper.SplatTmpl.testText ()
      ----------------------------------------------------------------------
      Traceback (most recent call last):
      File "C:\Python26\lib\site-packages\Cheetah\Tests\CheetahWrapper.py", line 276, in testText
      self.go("cheetah fill --oext txt *.tmpl")
      File "C:\Python26\lib\site-packages\Cheetah\Tests\CheetahWrapper.py", line 192, in go
      self.failUnlessEqual(signal, 0, msg)
      File "C:\Python26\lib\site-packages\Cheetah\Tests\unittest_local_copy.py", line 413, in failUnlessEqual
      raise self.failureException, (msg or '%s != %s' % (first, second))
      AssertionError: subcommand killed by signal 1: cheetah fill --oext txt *.tmpl

      **********************************************************************
      FAIL Cheetah.Tests.CheetahWrapper.SplatTmplWithSubdirectories.testCompile ()
      ----------------------------------------------------------------------
      Traceback (most recent call last):
      File "C:\Python26\lib\site-packages\Cheetah\Tests\CheetahWrapper.py", line 321, in testCompile
      self.go("cheetah compile *.tmpl child/*.tmpl child/grandkid/*.tmpl")
      File "C:\Python26\lib\site-packages\Cheetah\Tests\CheetahWrapper.py", line 192, in go
      self.failUnlessEqual(signal, 0, msg)
      File "C:\Python26\lib\site-packages\Cheetah\Tests\unittest_local_copy.py", line 413, in failUnlessEqual
      raise self.failureException, (msg or '%s != %s' % (first, second))
      AssertionError: subcommand killed by signal 1: cheetah compile *.tmpl child/*.tmpl child/grandkid/*.tmpl

      **********************************************************************
      FAIL Cheetah.Tests.CheetahWrapper.SplatTmplWithSubdirectories.testFill ()
      ----------------------------------------------------------------------
      Traceback (most recent call last):
      File "C:\Python26\lib\site-packages\Cheetah\Tests\CheetahWrapper.py", line 327, in testFill
      self.go("cheetah fill *.tmpl child/*.tmpl child/grandkid/*.tmpl")
      File "C:\Python26\lib\site-packages\Cheetah\Tests\CheetahWrapper.py", line 192, in go
      self.failUnlessEqual(signal, 0, msg)
      File "C:\Python26\lib\site-packages\Cheetah\Tests\unittest_local_copy.py", line 413, in failUnlessEqual
      raise self.failureException, (msg or '%s != %s' % (first, second))
      AssertionError: subcommand killed by signal 1: cheetah fill *.tmpl child/*.tmpl child/grandkid/*.tmpl

      **********************************************************************
      FAIL Cheetah.Tests.CheetahWrapper.SplatTmplWithSubdirectories.testText ()
      ----------------------------------------------------------------------
      Traceback (most recent call last):
      File "C:\Python26\lib\site-packages\Cheetah\Tests\CheetahWrapper.py", line 333, in testText
      self.go("cheetah fill --oext txt *.tmpl child/*.tmpl child/grandkid/*.tmpl")
      File "C:\Python26\lib\site-packages\Cheetah\Tests\CheetahWrapper.py", line 192, in go
      self.failUnlessEqual(signal, 0, msg)
      File "C:\Python26\lib\site-packages\Cheetah\Tests\unittest_local_copy.py", line 413, in failUnlessEqual
      raise self.failureException, (msg or '%s != %s' % (first, second))
      AssertionError: subcommand killed by signal 1: cheetah fill --oext txt *.tmpl child/*.tmpl child/grandkid/*.tmpl

      **********************************************************************
      FAIL Cheetah.Tests.CheetahWrapper.ThreeFilesWithSubdirectories.testCompile ()
      ----------------------------------------------------------------------
      Traceback (most recent call last):
      File "C:\Python26\lib\site-packages\Cheetah\Tests\CheetahWrapper.py", line 281, in testCompile
      self.go("cheetah compile a.tmpl child/a.tmpl child/grandkid/a.tmpl")
      File "C:\Python26\lib\site-packages\Cheetah\Tests\CheetahWrapper.py", line 192, in go
      self.failUnlessEqual(signal, 0, msg)
      File "C:\Python26\lib\site-packages\Cheetah\Tests\unittest_local_copy.py", line 413, in failUnlessEqual
      raise self.failureException, (msg or '%s != %s' % (first, second))
      AssertionError: subcommand killed by signal 1: cheetah compile a.tmpl child/a.tmpl child/grandkid/a.tmpl

      **********************************************************************
      FAIL Cheetah.Tests.CheetahWrapper.ThreeFilesWithSubdirectories.testFill ()
      ----------------------------------------------------------------------
      Traceback (most recent call last):
      File "C:\Python26\lib\site-packages\Cheetah\Tests\CheetahWrapper.py", line 287, in testFill
      self.go("cheetah fill a.tmpl child/a.tmpl child/grandkid/a.tmpl")
      File "C:\Python26\lib\site-packages\Cheetah\Tests\CheetahWrapper.py", line 192, in go
      self.failUnlessEqual(signal, 0, msg)
      File "C:\Python26\lib\site-packages\Cheetah\Tests\unittest_local_copy.py", line 413, in failUnlessEqual
      raise self.failureException, (msg or '%s != %s' % (first, second))
      AssertionError: subcommand killed by signal 1: cheetah fill a.tmpl child/a.tmpl child/grandkid/a.tmpl

      **********************************************************************
      FAIL Cheetah.Tests.CheetahWrapper.ThreeFilesWithSubdirectories.testText ()
      ----------------------------------------------------------------------
      Traceback (most recent call last):
      File "C:\Python26\lib\site-packages\Cheetah\Tests\CheetahWrapper.py", line 293, in testText
      self.go("cheetah fill --oext txt a.tmpl child/a.tmpl child/grandkid/a.tmpl")
      File "C:\Python26\lib\site-packages\Cheetah\Tests\CheetahWrapper.py", line 192, in go
      self.failUnlessEqual(signal, 0, msg)
      File "C:\Python26\lib\site-packages\Cheetah\Tests\unittest_local_copy.py", line 413, in failUnlessEqual
      raise self.failureException, (msg or '%s != %s' % (first, second))
      AssertionError: subcommand killed by signal 1: cheetah fill --oext txt a.tmpl child/a.tmpl child/grandkid/a.tmpl

      **********************************************************************
      FAIL Cheetah.Tests.CheetahWrapper.ThreeFilesWithSubdirectoriesNoExtension.testCompile ()
      ----------------------------------------------------------------------
      Traceback (most recent call last):
      File "C:\Python26\lib\site-packages\Cheetah\Tests\CheetahWrapper.py", line 301, in testCompile
      self.go("cheetah compile a child/a child/grandkid/a")
      File "C:\Python26\lib\site-packages\Cheetah\Tests\CheetahWrapper.py", line 192, in go
      self.failUnlessEqual(signal, 0, msg)
      File "C:\Python26\lib\site-packages\Cheetah\Tests\unittest_local_copy.py", line 413, in failUnlessEqual
      raise self.failureException, (msg or '%s != %s' % (first, second))
      AssertionError: subcommand killed by signal 1: cheetah compile a child/a child/grandkid/a

      **********************************************************************
      FAIL Cheetah.Tests.CheetahWrapper.ThreeFilesWithSubdirectoriesNoExtension.testFill ()
      ----------------------------------------------------------------------
      Traceback (most recent call last):
      File "C:\Python26\lib\site-packages\Cheetah\Tests\CheetahWrapper.py", line 307, in testFill
      self.go("cheetah fill a child/a child/grandkid/a")
      File "C:\Python26\lib\site-packages\Cheetah\Tests\CheetahWrapper.py", line 192, in go
      self.failUnlessEqual(signal, 0, msg)
      File "C:\Python26\lib\site-packages\Cheetah\Tests\unittest_local_copy.py", line 413, in failUnlessEqual
      raise self.failureException, (msg or '%s != %s' % (first, second))
      AssertionError: subcommand killed by signal 1: cheetah fill a child/a child/grandkid/a

      **********************************************************************
      FAIL Cheetah.Tests.CheetahWrapper.ThreeFilesWithSubdirectoriesNoExtension.testText ()
      ----------------------------------------------------------------------
      Traceback (most recent call last):
      File "C:\Python26\lib\site-packages\Cheetah\Tests\CheetahWrapper.py", line 313, in testText
      self.go("cheetah fill --oext txt a child/a child/grandkid/a")
      File "C:\Python26\lib\site-packages\Cheetah\Tests\CheetahWrapper.py", line 192, in go
      self.failUnlessEqual(signal, 0, msg)
      File "C:\Python26\lib\site-packages\Cheetah\Tests\unittest_local_copy.py", line 413, in failUnlessEqual
      raise self.failureException, (msg or '%s != %s' % (first, second))
      AssertionError: subcommand killed by signal 1: cheetah fill --oext txt a child/a child/grandkid/a

      **********************************************************************
      FAIL Cheetah.Tests.CheetahWrapper.VarietyWithOdir.testCompile ()
      ----------------------------------------------------------------------
      Traceback (most recent call last):
      File "C:\Python26\lib\site-packages\Cheetah\Tests\CheetahWrapper.py", line 356, in testCompile
      self.go("cheetah compile --odir DEST a.tmpl child/a child/grandkid/*.tmpl")
      File "C:\Python26\lib\site-packages\Cheetah\Tests\CheetahWrapper.py", line 192, in go
      self.failUnlessEqual(signal, 0, msg)
      File "C:\Python26\lib\site-packages\Cheetah\Tests\unittest_local_copy.py", line 413, in failUnlessEqual
      raise self.failureException, (msg or '%s != %s' % (first, second))
      AssertionError: subcommand killed by signal 1: cheetah compile --odir DEST a.tmpl child/a child/grandkid/*.tmpl

      **********************************************************************
      FAIL Cheetah.Tests.CheetahWrapper.VarietyWithOdir.testFill ()
      ----------------------------------------------------------------------
      Traceback (most recent call last):
      File "C:\Python26\lib\site-packages\Cheetah\Tests\CheetahWrapper.py", line 365, in testFill
      self.go("cheetah fill --odir DEST a.tmpl child/a child/grandkid/*.tmpl")
      File "C:\Python26\lib\site-packages\Cheetah\Tests\CheetahWrapper.py", line 192, in go
      self.failUnlessEqual(signal, 0, msg)
      File "C:\Python26\lib\site-packages\Cheetah\Tests\unittest_local_copy.py", line 413, in failUnlessEqual
      raise self.failureException, (msg or '%s != %s' % (first, second))
      AssertionError: subcommand killed by signal 1: cheetah fill --odir DEST a.tmpl child/a child/grandkid/*.tmpl

      **********************************************************************
      FAIL Cheetah.Tests.CheetahWrapper.VarietyWithOdir.testText ()
      ----------------------------------------------------------------------
      Traceback (most recent call last):
      File "C:\Python26\lib\site-packages\Cheetah\Tests\CheetahWrapper.py", line 371, in testText
      self.go("cheetah fill --odir DEST --oext txt a.tmpl child/a child/grandkid/*.tmpl")
      File "C:\Python26\lib\site-packages\Cheetah\Tests\CheetahWrapper.py", line 192, in go
      self.failUnlessEqual(signal, 0, msg)
      File "C:\Python26\lib\site-packages\Cheetah\Tests\unittest_local_copy.py", line 413, in failUnlessEqual
      raise self.failureException, (msg or '%s != %s' % (first, second))
      AssertionError: subcommand killed by signal 1: cheetah fill --odir DEST --oext txt a.tmpl child/a child/grandkid/*.tmpl

      ----------------------------------------------------------------------
      Ran 1596 tests in 69.758s

      FAILED (failures=51)

      What am I doing wrong?

      tOM
      -- Absum! --
      tOM Trottier, +1 613 860-6633 Skype:Abacurial
      469 Ancaster Ave, Ottawa, ON K2B 5B6 Canada
      http://Information.Architecture.Abacurial.com
      Do you really need to print this email?


      ------------------------------------------------------------------------------

      _______________________________________________
      Cheetahtemplate-discuss mailing list
      Cheetahtemplate-discuss@...
      https://lists.sourceforge.net/lists/listinfo/cheetahtemplate-discuss
    • R. Tyler Ballance
      ... These tests probably fall more into integration test land since they re invoking a `cheetah compile`, the issue is the spawned process can t seem t find
      Message 2 of 2 , May 24, 2010
      • 0 Attachment
        On Sun, 23 May 2010, tOM Trottier wrote:

        > I am new to Python and Cheetah and having problems getting going.
        > Am using Pythonxy Eclipse framework.
        >
        > But when I run Cheetah test I get these errors:
        >

        These tests probably fall more into "integration test land" since they're
        invoking a `cheetah compile`, the issue is the spawned process can't seem t
        find the executable in the PATH

        I personally use this little script when developing:
        http://github.com/rtyler/cheetah/blob/master/buildandrun

        Cheers,
        -R. Tyler Ballance
        --------------------------------------
        Jabber: rtyler@...
        GitHub: http://github.com/rtyler
        Identica: http://identi.ca/dero
        Twitter: http://twitter.com/agentdero
        Blog: http://unethicalblogger.com
      Your message has been successfully submitted and would be delivered to recipients shortly.