Loading ...
Sorry, an error occurred while loading the content.

Failed upgrade

Expand Messages
  • ns7c
    Hi Gang-- I m finally getting around to upgrading my gateway. I currently have 2.0.0 Beta2 installed. Based on the instructions in the INSTALLING file, I
    Message 1 of 3 , Feb 10, 2012
    • 0 Attachment
      Hi Gang--
      I'm finally getting around to upgrading my gateway. I currently have 2.0.0 Beta2 installed. Based on the instructions in the INSTALLING file, I should only need to run make and make install. Of course, I have errors on the compile, here is the output from the make:


      Building Linux RMS Gateway for i686 platform...
      for dir in librms rmsgw rmsgw_aci rmsgwmon; do make -C $dir all ; done
      make[1]: Entering directory `/usr/local/src/ax25/rmsgw-2.1.0-138/librms'
      make[1]: Nothing to be done for `all'.
      make[1]: Leaving directory `/usr/local/src/ax25/rmsgw-2.1.0-138/librms'
      make[1]: Entering directory `/usr/local/src/ax25/rmsgw-2.1.0-138/rmsgw'
      cat Makefile | makedepend -f - -- -DLINUX -DGWMONITOR -I/usr/local/src/ax25/rmsgw-2.1.0-138/rmsgw/../include -I/usr/include/libxml2 -g -- rmsgw.c gwinit.c greet.c banner.c session.c gateway.c log_login.c log_logout.c glob.c >depend 2>/dev/null
      make[1]: Nothing to be done for `all'.
      make[1]: Leaving directory `/usr/local/src/ax25/rmsgw-2.1.0-138/rmsgw'
      make[1]: Entering directory `/usr/local/src/ax25/rmsgw-2.1.0-138/rmsgw_aci'
      cat Makefile | makedepend -f - -- -DLINUX -DGWMONITOR -I/usr/local/src/ax25/rmsgw-2.1.0-138/rmsgw_aci/../include -I/usr/include/libxml2 -g -- rmsgw_aci.c wl2k_aci.c sendversion.c sendchannel.c glob.c >depend 2>/dev/null
      make[1]: Nothing to be done for `all'.
      make[1]: Leaving directory `/usr/local/src/ax25/rmsgw-2.1.0-138/rmsgw_aci'
      make[1]: Entering directory `/usr/local/src/ax25/rmsgw-2.1.0-138/rmsgwmon'
      cat Makefile | makedepend -f - -- -DLINUX -DGWMONITOR -I/usr/local/src/ax25/rmsgw-2.1.0-138/rmsgwmon/../include -I/usr/include/libxml2 -g -- rmsgwmon.c glob.c >depend 2>/dev/null
      gcc -DLINUX -DGWMONITOR -I/usr/local/src/ax25/rmsgw-2.1.0-138/rmsgwmon/../include -I/usr/include/libxml2 -g -c -o rmsgwmon.o rmsgwmon.c
      rmsgwmon.c:45:21: error: ncurses.h: No such file or directory
      rmsgwmon.c:73: error: expected â=â, â,â, â;â, âasmâ or â__attribute__â before â*â token
      rmsgwmon.c:74: error: expected â=â, â,â, â;â, âasmâ or â__attribute__â before â*â token
      rmsgwmon.c:144: error: expected â)â before â*â token
      rmsgwmon.c:282: error: expected â)â before â*â token
      rmsgwmon.c: In function âShowStatusâ:
      rmsgwmon.c:361: error: âaciwinâ undeclared (first use in this function)
      rmsgwmon.c:361: error: (Each undeclared identifier is reported only once
      rmsgwmon.c:361: error: for each function it appears in.)
      rmsgwmon.c:362: error: âgwwinâ undeclared (first use in this function)
      rmsgwmon.c: At top level:
      rmsgwmon.c:371: error: expected â)â before â*â token
      rmsgwmon.c: In function âscrInitâ:
      rmsgwmon.c:391: error: âstdscrâ undeclared (first use in this function)
      rmsgwmon.c:391: error: âTRUEâ undeclared (first use in this function)
      rmsgwmon.c:397: error: âCOLOR_WHITEâ undeclared (first use in this function)
      rmsgwmon.c:397: error: âCOLOR_BLACKâ undeclared (first use in this function)
      rmsgwmon.c:398: error: âCOLOR_YELLOWâ undeclared (first use in this function)
      rmsgwmon.c:399: error: âCOLOR_GREENâ undeclared (first use in this function)
      rmsgwmon.c:400: error: âCOLOR_CYANâ undeclared (first use in this function)
      rmsgwmon.c:401: error: âCOLOR_BLUEâ undeclared (first use in this function)
      rmsgwmon.c:402: error: âCOLOR_REDâ undeclared (first use in this function)
      rmsgwmon.c: In function âgwStatRunâ:
      rmsgwmon.c:457: error: âmsgwinâ undeclared (first use in this function)
      rmsgwmon.c:457: error: âCOLSâ undeclared (first use in this function)
      rmsgwmon.c:457: error: âLINESâ undeclared (first use in this function)
      rmsgwmon.c:458: error: âFALSEâ undeclared (first use in this function)
      rmsgwmon.c:464: error: âbstatwinâ undeclared (first use in this function)
      rmsgwmon.c:477: error: âaciwinâ undeclared (first use in this function)
      rmsgwmon.c:479: error: âgwwinâ undeclared (first use in this function)
      rmsgwmon.c:549: error: case label does not reduce to an integer constant
      make[1]: *** [rmsgwmon.o] Error 1
      make[1]: Leaving directory `/usr/local/src/ax25/rmsgw-2.1.0-138/rmsgwmon'
      make: *** [all] Error 2

      Can someone point me in the right direction?

      -Scott
    • Jordan Hayes KG6UAE
      ... You need to install the ncurses package (or probably ncurses-devel?).
      Message 2 of 3 , Feb 10, 2012
      • 0 Attachment
        > rmsgwmon.c:45:21: error: ncurses.h: No such file or directory

        You need to install the ncurses package (or probably ncurses-devel?).
      • ns7c
        ... Yep, libncurses5-dev. It compiled OK now. Thanks! -Scott
        Message 3 of 3 , Feb 10, 2012
        • 0 Attachment
          --- In LinuxRMS@yahoogroups.com, "Jordan Hayes KG6UAE" <kg6uae@...> wrote:
          >
          > > rmsgwmon.c:45:21: error: ncurses.h: No such file or directory
          >
          > You need to install the ncurses package (or probably ncurses-devel?).
          >
          Yep, libncurses5-dev. It compiled OK now.

          Thanks!
          -Scott
        Your message has been successfully submitted and would be delivered to recipients shortly.